User Tag List

Page 1 of 2 1 2 LastLast
Results 1 to 10 of 12

Thread: error construction apps (build apps)

  1. #1
    Clicker Fusion 2.5 DeveloperFusion 2.5 DeveloperAndroid Export ModuleHTML5 Export ModuleiOS Export ModuleSWF Export ModuleMac Export Module

    Join Date
    Jun 2014
    Location
    France
    Posts
    151
    Mentioned
    0 Post(s)
    Tagged
    0 Thread(s)

    error construction apps (build apps)

    J'ai un soucis pour construire mon application voici le rapport d'erreur


    Buildfile: C:\Users\POURFO~1\AppData\Local\Temp\And983C.tmp\b uild.xml

    -set-mode-check:

    -set-debug-files:

    -check-env:
    [checkenv] Android SDK Tools Revision 23.0.2
    [checkenv] Installed at C:\Android\Android SDK

    -setup:
    [echo] Project Name: RuntimeAndroid
    [gettype] Project Type: Application

    -set-debug-mode:

    -debug-obfuscation-check:

    -pre-build:

    -build-setup:
    [getbuildtools] Using latest Build Tools: 20.0.0
    [echo] Resolving Build Target for RuntimeAndroid...

    BUILD FAILED
    C:\Android\Android SDK\tools\ant\build.xml:542: Unable to resolve project target 'android-14'

    Total time: 1 second


    Une petite idée ?

  2. #2
    Clicker Multimedia Fusion 2
    Fusion 2.5 (Steam)Fusion 2.5 Developer (Steam)Android Export Module (Steam)iOS Export Module (Steam)

    Join Date
    May 2012
    Location
    King's Landing
    Posts
    143
    Mentioned
    1 Post(s)
    Tagged
    0 Thread(s)
    essaye peut etre de changer la version de l'api android dans les propriétés android de ton application. Il faut peut etre mettre 19 au lieu de 14

  3. #3
    Clickteam Clickteam

    Join Date
    Jun 2006
    Location
    France
    Posts
    12,839
    Mentioned
    83 Post(s)
    Tagged
    2 Thread(s)
    Il faut mettre le numéro d'une API qui est installé, API 14 au minimum (lancer le SDK Manager d'Android et voir lesquelles sont installées, s'il n'y en a aucune installer au minimum la 14).

  4. #4
    Clicker Fusion 2.5 DeveloperFusion 2.5 DeveloperAndroid Export ModuleHTML5 Export ModuleiOS Export ModuleSWF Export ModuleMac Export Module

    Join Date
    Jun 2014
    Location
    France
    Posts
    151
    Mentioned
    0 Post(s)
    Tagged
    0 Thread(s)
    Merci a vous deux j'ai réussi a régler le soucis

    J'ai installé tout par contre il met énormément de temps a construire

  5. #5
    Clicker Fusion 2.5 DeveloperFusion 2.5 DeveloperAndroid Export ModuleHTML5 Export ModuleiOS Export ModuleSWF Export ModuleMac Export Module

    Join Date
    Jun 2014
    Location
    France
    Posts
    151
    Mentioned
    0 Post(s)
    Tagged
    0 Thread(s)
    Buildfile: C:\Users\Moucklee\AppData\Local\Temp\And1DD1.tmp\b uild.xml

    -set-mode-check:

    -set-debug-files:

    -check-env:
    [checkenv] Android SDK Tools Revision 23.0.5
    [checkenv] Installed at C:\Android

    -setup:
    [echo] Project Name: RuntimeAndroid
    [gettype] Project Type: Application

    -set-debug-mode:

    -debug-obfuscation-check:

    -pre-build:

    -build-setup:
    [getbuildtools] Using latest Build Tools: 20.0.0
    [echo] Resolving Build Target for RuntimeAndroid...
    [gettarget] Project Target: Android 4.0
    [gettarget] API level: 14
    [echo] ----------
    [echo] Creating output directories if needed...
    [mkdir] Created dir: C:\Users\Moucklee\AppData\Local\Temp\And1DD1.tmp\b in
    [mkdir] Created dir: C:\Users\Moucklee\AppData\Local\Temp\And1DD1.tmp\b in\res
    [mkdir] Created dir: C:\Users\Moucklee\AppData\Local\Temp\And1DD1.tmp\b in\rsObj
    [mkdir] Created dir: C:\Users\Moucklee\AppData\Local\Temp\And1DD1.tmp\b in\rsLibs
    [mkdir] Created dir: C:\Users\Moucklee\AppData\Local\Temp\And1DD1.tmp\g en
    [mkdir] Created dir: C:\Users\Moucklee\AppData\Local\Temp\And1DD1.tmp\b in\classes
    [mkdir] Created dir: C:\Users\Moucklee\AppData\Local\Temp\And1DD1.tmp\b in\dexedLibs
    [echo] ----------
    [echo] Resolving Dependencies for RuntimeAndroid...
    [dependency] Library dependencies:
    [dependency] No Libraries
    [dependency]
    [dependency] ------------------
    [dependency] API<=15: Adding annotations.jar to the classpath.
    [echo] ----------
    [echo] Building Libraries with 'debug'...
    [subant] No sub-builds to iterate on

    -code-gen:
    [mergemanifest] Merging AndroidManifest files into one.
    [mergemanifest] Manifest merger disabled. Using project manifest only.
    [echo] Handling aidl files...
    [aidl] No AIDL files to compile.
    [echo] ----------
    [echo] Handling RenderScript files...
    [echo] ----------
    [echo] Handling Resources...
    [aapt] Generating resource IDs...
    [echo] ----------
    [echo] Handling BuildConfig class...
    [buildconfig] Generating BuildConfig class.

    -pre-compile:

    -compile:
    [javac] Compiling 325 source files to C:\Users\Moucklee\AppData\Local\Temp\And1DD1.tmp\b in\classes
    [javac] warning: [options] source value 1.5 is obsolete and will be removed in a future release
    [javac] warning: [options] target value 1.5 is obsolete and will be removed in a future release
    [javac] warning: [options] To suppress warnings about obsolete options, use -Xlint:-options.
    [javac] C:\Users\Moucklee\AppData\Local\Temp\And1DD1.tmp\s rc\Extensions\CRunBox2DBase.java:42: error: package com.badlogic.gdx.math does not exist
    [javac] import com.badlogic.gdx.math.MathUtils;
    [javac] ^
    [javac] C:\Users\Moucklee\AppData\Local\Temp\And1DD1.tmp\s rc\Extensions\CRunBox2DBase.java:43: error: package com.badlogic.gdx.math does not exist
    [javac] import com.badlogic.gdx.math.Vector2;
    [javac] ^
    [javac] C:\Users\Moucklee\AppData\Local\Temp\And1DD1.tmp\s rc\Extensions\CRunBox2DBase.java:44: error: package com.badlogic.gdx.physics.box2d does not exist
    [javac] import com.badlogic.gdx.physics.box2d.*;
    [javac] ^
    [javac] C:\Users\Moucklee\AppData\Local\Temp\And1DD1.tmp\s rc\Extensions\CRunBox2DBase.java:45: error: package com.badlogic.gdx.physics.box2d.joints does not exist
    [javac] import com.badlogic.gdx.physics.box2d.joints.*;
    [javac] ^
    [javac] C:\Users\Moucklee\AppData\Local\Temp\And1DD1.tmp\s rc\Extensions\CRunBox2DBase.java:49: error: cannot find symbol
    [javac] public class CRunBox2DBase extends CRunBaseParent
    [javac] ^
    [javac] symbol: class CRunBaseParent
    [javac] C:\Users\Moucklee\AppData\Local\Temp\And1DD1.tmp\s rc\Extensions\CRunBox2DBase.java:138: error: cannot find symbol
    [javac] private ArrayList<CRunBaseParent> fans = new ArrayList<CRunBaseParent>();
    [javac] ^
    [javac] symbol: class CRunBaseParent
    [javac] location: class CRunBox2DBase
    [javac] C:\Users\Moucklee\AppData\Local\Temp\And1DD1.tmp\s rc\Extensions\CRunBox2DBase.java:139: error: cannot find symbol
    [javac] private ArrayList<CRunBaseParent> treadmills = new ArrayList<CRunBaseParent>();
    [javac] ^
    [javac] symbol: class CRunBaseParent
    [javac] location: class CRunBox2DBase
    [javac] C:\Users\Moucklee\AppData\Local\Temp\And1DD1.tmp\s rc\Extensions\CRunBox2DBase.java:140: error: cannot find symbol
    [javac] private ArrayList<CRunBaseParent> magnets = new ArrayList<CRunBaseParent>();
    [javac] ^
    [javac] symbol: class CRunBaseParent
    [javac] location: class CRunBox2DBase
    [javac] C:\Users\Moucklee\AppData\Local\Temp\And1DD1.tmp\s rc\Extensions\CRunBox2DBase.java:147: error: cannot find symbol
    [javac] public World world = null;
    [javac] ^
    [javac] symbol: class World
    [javac] location: class CRunBox2DBase
    [javac] C:\Users\Moucklee\AppData\Local\Temp\And1DD1.tmp\s rc\Extensions\CRunBox2DBase.java:2412: error: cannot find symbol
    [javac] class CContactListener implements ContactListener
    [javac] ^
    [javac] symbol: class ContactListener
    [javac] C:\Users\Moucklee\AppData\Local\Temp\And1DD1.tmp\s rc\Extensions\CRunBox2DBase.java:161: error: cannot find symbol
    [javac] ArrayList<CRunMBase> objects = new ArrayList<CRunMBase>();
    [javac] ^
    [javac] symbol: class CRunMBase
    [javac] location: class CRunBox2DBase
    [javac] C:\Users\Moucklee\AppData\Local\Temp\And1DD1.tmp\s rc\Extensions\CRunBox2DBase.java:486: error: cannot find symbol
    [javac] public CRunMBase GetMBase(CObject pHo)
    [javac] ^
    [javac] symbol: class CRunMBase
    [javac] location: class CRunBox2DBase
    [javac] C:\Users\Moucklee\AppData\Local\Temp\And1DD1.tmp\s rc\Extensions\CRunBox2DBase.java:610: error: cannot find symbol
    [javac] private Vector2 GetActionPointPosition(CRunMBase pBase)
    [javac] ^
    [javac] symbol: class CRunMBase
    [javac] location: class CRunBox2DBase
    [javac] C:\Users\Moucklee\AppData\Local\Temp\And1DD1.tmp\s rc\Extensions\CRunBox2DBase.java:610: error: cannot find symbol
    [javac] private Vector2 GetActionPointPosition(CRunMBase pBase)
    [javac] ^
    [javac] symbol: class Vector2
    [javac] location: class CRunBox2DBase
    [javac] C:\Users\Moucklee\AppData\Local\Temp\And1DD1.tmp\s rc\Extensions\CRunBox2DBase.java:679: error: cannot find symbol
    [javac] private Vector2 GetImagePosition(CRunMBase pBase, int x1, int y1)
    [javac] ^
    [javac] symbol: class CRunMBase
    [javac] location: class CRunBox2DBase
    [javac] C:\Users\Moucklee\AppData\Local\Temp\And1DD1.tmp\s rc\Extensions\CRunBox2DBase.java:679: error: cannot find symbol
    [javac] private Vector2 GetImagePosition(CRunMBase pBase, int x1, int y1)
    [javac] ^
    [javac] symbol: class Vector2
    [javac] location: class CRunBox2DBase
    [javac] C:\Users\Moucklee\AppData\Local\Temp\And1DD1.tmp\s rc\Extensions\CRunBox2DBase.java:957: error: cannot find symbol
    [javac] private void destroyJointsWithBody(Body body)
    [javac] ^
    [javac] symbol: class Body
    [javac] location: class CRunBox2DBase
    [javac] C:\Users\Moucklee\AppData\Local\Temp\And1DD1.tmp\s rc\Extensions\CRunBox2DBase.java:1074: error: cannot find symbol
    [javac] public Joint rJointCreate(CRunMBase pMBase1, short jointType, short jointAnchor, String jointName, String jointObject, float param1, float param2)
    [javac] ^
    [javac] symbol: class CRunMBase
    [javac] location: class CRunBox2DBase
    [javac] C:\Users\Moucklee\AppData\Local\Temp\And1DD1.tmp\s rc\Extensions\CRunBox2DBase.java:1074: error: cannot find symbol
    [javac] public Joint rJointCreate(CRunMBase pMBase1, short jointType, short jointAnchor, String jointName, String jointObject, float param1, float param2)
    [javac] ^
    [javac] symbol: class Joint
    [javac] location: class CRunBox2DBase
    [javac] C:\Users\Moucklee\AppData\Local\Temp\And1DD1.tmp\s rc\Extensions\CRunBox2DBase.java:1195: error: cannot find symbol
    [javac] public void rWorldToFrame(Vector2 pVec)
    [javac] ^
    [javac] symbol: class Vector2
    [javac] location: class CRunBox2DBase
    [javac] C:\Users\Moucklee\AppData\Local\Temp\And1DD1.tmp\s rc\Extensions\CRunBox2DBase.java:1201: error: cannot find symbol
    [javac] public void rFrameToWorld(Vector2 pVec)
    [javac] ^
    [javac] symbol: class Vector2
    [javac] location: class CRunBox2DBase
    [javac] C:\Users\Moucklee\AppData\Local\Temp\And1DD1.tmp\s rc\Extensions\CRunBox2DBase.java:1236: error: package BodyDef does not exist
    [javac] public Body rCreateBody(BodyDef.BodyType type, int x, int y, float angle, float gravity, CRunMBase pBase, int flags, float deceleration)
    [javac] ^
    [javac] C:\Users\Moucklee\AppData\Local\Temp\And1DD1.tmp\s rc\Extensions\CRunBox2DBase.java:1236: error: cannot find symbol
    [javac] public Body rCreateBody(BodyDef.BodyType type, int x, int y, float angle, float gravity, CRunMBase pBase, int flags, float deceleration)
    [javac] ^
    [javac] symbol: class CRunMBase
    [javac] location: class CRunBox2DBase
    [javac] C:\Users\Moucklee\AppData\Local\Temp\And1DD1.tmp\s rc\Extensions\CRunBox2DBase.java:1236: error: cannot find symbol
    [javac] public Body rCreateBody(BodyDef.BodyType type, int x, int y, float angle, float gravity, CRunMBase pBase, int flags, float deceleration)
    [javac] ^
    [javac] symbol: class Body
    [javac] location: class CRunBox2DBase
    [javac] C:\Users\Moucklee\AppData\Local\Temp\And1DD1.tmp\s rc\Extensions\CRunBox2DBase.java:1267: error: cannot find symbol
    [javac] public void rDestroyBody(Body pBody)
    [javac] ^
    [javac] symbol: class Body
    [javac] location: class CRunBox2DBase
    [javac] C:\Users\Moucklee\AppData\Local\Temp\And1DD1.tmp\s rc\Extensions\CRunBox2DBase.java:1286: error: cannot find symbol
    [javac] public Fixture rBodyCreateBoxFixture(Body pBody, CRunMBase pMBase, int x, int y, int sx, int sy, float density, float friction, float restitution)
    [javac] ^
    [javac] symbol: class Body
    [javac] location: class CRunBox2DBase
    [javac] C:\Users\Moucklee\AppData\Local\Temp\And1DD1.tmp\s rc\Extensions\CRunBox2DBase.java:1286: error: cannot find symbol
    [javac] public Fixture rBodyCreateBoxFixture(Body pBody, CRunMBase pMBase, int x, int y, int sx, int sy, float density, float friction, float restitution)
    [javac] ^
    [javac] symbol: class CRunMBase
    [javac] location: class CRunBox2DBase
    [javac] C:\Users\Moucklee\AppData\Local\Temp\And1DD1.tmp\s rc\Extensions\CRunBox2DBase.java:1286: error: cannot find symbol
    [javac] public Fixture rBodyCreateBoxFixture(Body pBody, CRunMBase pMBase, int x, int y, int sx, int sy, float density, float friction, float restitution)
    [javac] ^
    [javac] symbol: class Fixture
    [javac] location: class CRunBox2DBase
    [javac] C:\Users\Moucklee\AppData\Local\Temp\And1DD1.tmp\s rc\Extensions\CRunBox2DBase.java:1312: error: cannot find symbol
    [javac] public Fixture rBodyCreateCircleFixture(Body pBody, CRunMBase pMBase, int x, int y, int radius, float density, float friction, float restitution)
    [javac] ^
    [javac] symbol: class Body
    [javac] location: class CRunBox2DBase
    [javac] C:\Users\Moucklee\AppData\Local\Temp\And1DD1.tmp\s rc\Extensions\CRunBox2DBase.java:1312: error: cannot find symbol
    [javac] public Fixture rBodyCreateCircleFixture(Body pBody, CRunMBase pMBase, int x, int y, int radius, float density, float friction, float restitution)
    [javac] ^
    [javac] symbol: class CRunMBase
    [javac] location: class CRunBox2DBase
    [javac] C:\Users\Moucklee\AppData\Local\Temp\And1DD1.tmp\s rc\Extensions\CRunBox2DBase.java:1312: error: cannot find symbol
    [javac] public Fixture rBodyCreateCircleFixture(Body pBody, CRunMBase pMBase, int x, int y, int radius, float density, float friction, float restitution)
    [javac] ^
    [javac] symbol: class Fixture
    [javac] location: class CRunBox2DBase
    [javac] C:\Users\Moucklee\AppData\Local\Temp\And1DD1.tmp\s rc\Extensions\CRunBox2DBase.java:1338: error: cannot find symbol
    [javac] public Joint rCreateDistanceJoint(Body pBody1, Body pBody2, float dampingRatio, float frequency, int x, int y)
    [javac] ^
    [javac] symbol: class Body
    [javac] location: class CRunBox2DBase
    [javac] C:\Users\Moucklee\AppData\Local\Temp\And1DD1.tmp\s rc\Extensions\CRunBox2DBase.java:1338: error: cannot find symbol
    [javac] public Joint rCreateDistanceJoint(Body pBody1, Body pBody2, float dampingRatio, float frequency, int x, int y)
    [javac] ^
    [javac] symbol: class Body
    [javac] location: class CRunBox2DBase
    [javac] C:\Users\Moucklee\AppData\Local\Temp\And1DD1.tmp\s rc\Extensions\CRunBox2DBase.java:1338: error: cannot find symbol
    [javac] public Joint rCreateDistanceJoint(Body pBody1, Body pBody2, float dampingRatio, float frequency, int x, int y)
    [javac] ^
    [javac] symbol: class Joint
    [javac] location: class CRunBox2DBase
    [javac] C:\Users\Moucklee\AppData\Local\Temp\And1DD1.tmp\s rc\Extensions\CRunBox2DBase.java:1351: error: cannot find symbol
    [javac] public void rBodyApplyForce(Body pBody, float force, float angle)
    [javac] ^
    [javac] symbol: class Body
    [javac] location: class CRunBox2DBase
    [javac] C:\Users\Moucklee\AppData\Local\Temp\And1DD1.tmp\s rc\Extensions\CRunBox2DBase.java:1369: error: cannot find symbol
    [javac] public void rBodyStopForce(Body pBody)
    [javac] ^
    [javac] symbol: class Body
    [javac] location: class CRunBox2DBase
    [javac] C:\Users\Moucklee\AppData\Local\Temp\And1DD1.tmp\s rc\Extensions\CRunBox2DBase.java:1384: error: cannot find symbol
    [javac] public void rBodyApplyAngularImpulse(Body pBody, float torque)
    [javac] ^
    [javac] symbol: class Body
    [javac] location: class CRunBox2DBase
    [javac] C:\Users\Moucklee\AppData\Local\Temp\And1DD1.tmp\s rc\Extensions\CRunBox2DBase.java:1388: error: cannot find symbol
    [javac] public void rBodyApplyTorque(Body pBody, float torque)
    [javac] ^
    [javac] symbol: class Body
    [javac] location: class CRunBox2DBase
    [javac] C:\Users\Moucklee\AppData\Local\Temp\And1DD1.tmp\s rc\Extensions\CRunBox2DBase.java:1404: error: cannot find symbol
    [javac] public void rBodyStopTorque(Body pBody)
    [javac] ^
    [javac] symbol: class Body
    [javac] location: class CRunBox2DBase
    [javac] C:\Users\Moucklee\AppData\Local\Temp\And1DD1.tmp\s rc\Extensions\CRunBox2DBase.java:1419: error: cannot find symbol
    [javac] public void rRJointSetLimits(RevoluteJoint pJoint, int angle1, int angle2)
    [javac] ^
    [javac] symbol: class RevoluteJoint
    [javac] location: class CRunBox2DBase
    [javac] C:\Users\Moucklee\AppData\Local\Temp\And1DD1.tmp\s rc\Extensions\CRunBox2DBase.java:1434: error: cannot find symbol
    [javac] public void rRJointSetMotor(RevoluteJoint pJoint, int t, int s)
    [javac] ^
    [javac] symbol: class RevoluteJoint
    [javac] location: class CRunBox2DBase
    [javac] C:\Users\Moucklee\AppData\Local\Temp\And1DD1.tmp\s rc\Extensions\CRunBox2DBase.java:1446: error: cannot find symbol
    [javac] public RevoluteJoint rWorldCreateRevoluteJoint(RevoluteJointDef jointDef, Body body1, Body body2, Vector2 position)
    [javac] ^
    [javac] symbol: class RevoluteJointDef
    [javac] location: class CRunBox2DBase
    [javac] C:\Users\Moucklee\AppData\Local\Temp\And1DD1.tmp\s rc\Extensions\CRunBox2DBase.java:1446: error: cannot find symbol
    [javac] public RevoluteJoint rWorldCreateRevoluteJoint(RevoluteJointDef jointDef, Body body1, Body body2, Vector2 position)
    [javac] ^
    [javac] symbol: class Body
    [javac] location: class CRunBox2DBase
    [javac] C:\Users\Moucklee\AppData\Local\Temp\And1DD1.tmp\s rc\Extensions\CRunBox2DBase.java:1446: error: cannot find symbol
    [javac] public RevoluteJoint rWorldCreateRevoluteJoint(RevoluteJointDef jointDef, Body body1, Body body2, Vector2 position)
    [javac] ^
    [javac] symbol: class Body
    [javac] location: class CRunBox2DBase
    [javac] C:\Users\Moucklee\AppData\Local\Temp\And1DD1.tmp\s rc\Extensions\CRunBox2DBase.java:1446: error: cannot find symbol
    [javac] public RevoluteJoint rWorldCreateRevoluteJoint(RevoluteJointDef jointDef, Body body1, Body body2, Vector2 position)
    [javac] ^
    [javac] symbol: class Vector2
    [javac] location: class CRunBox2DBase
    [javac] C:\Users\Moucklee\AppData\Local\Temp\And1DD1.tmp\s rc\Extensions\CRunBox2DBase.java:1446: error: cannot find symbol
    [javac] public RevoluteJoint rWorldCreateRevoluteJoint(RevoluteJointDef jointDef, Body body1, Body body2, Vector2 position)
    [javac] ^
    [javac] symbol: class RevoluteJoint
    [javac] location: class CRunBox2DBase
    [javac] C:\Users\Moucklee\AppData\Local\Temp\And1DD1.tmp\s rc\Extensions\CRunBox2DBase.java:1452: error: cannot find symbol
    [javac] public void rBodySetAngularVelocity(Body pBody, float torque)
    [javac] ^
    [javac] symbol: class Body
    [javac] location: class CRunBox2DBase
    [javac] C:\Users\Moucklee\AppData\Local\Temp\And1DD1.tmp\s rc\Extensions\CRunBox2DBase.java:1456: error: cannot find symbol
    [javac] public void rBodyAddVelocity(Body pBody, float vx, float vy)
    [javac] ^
    [javac] symbol: class Body
    [javac] location: class CRunBox2DBase
    [javac] C:\Users\Moucklee\AppData\Local\Temp\And1DD1.tmp\s rc\Extensions\CRunBox2DBase.java:1463: error: cannot find symbol
    [javac] public void rBodyApplyMMFImpulse(Body pBody, float force, float angle)
    [javac] ^
    [javac] symbol: class Body
    [javac] location: class CRunBox2DBase
    [javac] C:\Users\Moucklee\AppData\Local\Temp\And1DD1.tmp\s rc\Extensions\CRunBox2DBase.java:1473: error: cannot find symbol
    [javac] public void rBodyApplyImpulse(Body pBody, float force, float angle)
    [javac] ^
    [javac] symbol: class Body
    [javac] location: class CRunBox2DBase
    [javac] C:\Users\Moucklee\AppData\Local\Temp\And1DD1.tmp\s rc\Extensions\CRunBox2DBase.java:1479: error: cannot find symbol
    [javac] public float rBodyGetAngle(Body body)
    [javac] ^
    [javac] symbol: class Body
    [javac] location: class CRunBox2DBase
    [javac] C:\Users\Moucklee\AppData\Local\Temp\And1DD1.tmp\s rc\Extensions\CRunBox2DBase.java:1483: error: cannot find symbol
    [javac] public void rBodySetPosition(Body pBody, int x, int y)
    [javac] ^
    [javac] symbol: class Body
    [javac] location: class CRunBox2DBase
    [javac] C:\Users\Moucklee\AppData\Local\Temp\And1DD1.tmp\s rc\Extensions\CRunBox2DBase.java:1493: error: cannot find symbol
    [javac] public void rBodySetAngle(Body pBody, float angle)
    [javac] ^
    [javac] symbol: class Body
    [javac] location: class CRunBox2DBase
    [javac] C:\Users\Moucklee\AppData\Local\Temp\And1DD1.tmp\s rc\Extensions\CRunBox2DBase.java:1498: error: cannot find symbol
    [javac] public void rBodySetLinearVelocity(Body pBody, float force, float angle)
    [javac] ^
    [javac] symbol: class Body
    [javac] location: class CRunBox2DBase
    [javac] C:\Users\Moucklee\AppData\Local\Temp\And1DD1.tmp\s rc\Extensions\CRunBox2DBase.java:1504: error: cannot find symbol
    [javac] public void rBodyAddLinearVelocity(Body pBody, float speed, float angle)
    [javac] ^
    [javac] symbol: class Body
    [javac] location: class CRunBox2DBase
    [javac] C:\Users\Moucklee\AppData\Local\Temp\And1DD1.tmp\s rc\Extensions\CRunBox2DBase.java:1512: error: cannot find symbol
    [javac] public void rBodySetLinearVelocityAdd(Body pBody, float force, float angle, float vx, float vy)
    [javac] ^
    [javac] symbol: class Body
    [javac] location: class CRunBox2DBase
    [javac] C:\Users\Moucklee\AppData\Local\Temp\And1DD1.tmp\s rc\Extensions\CRunBox2DBase.java:1531: error: cannot find symbol
    [javac] public Fixture rBodyCreateShapeFixture(Body pBody, CRunMBase pMBase, int xp, int yp, short img, float density, float friction, float restitution, float scaleX, float scaleY)
    [javac] ^
    [javac] symbol: class Body
    [javac] location: class CRunBox2DBase
    [javac] C:\Users\Moucklee\AppData\Local\Temp\And1DD1.tmp\s rc\Extensions\CRunBox2DBase.java:1531: error: cannot find symbol
    [javac] public Fixture rBodyCreateShapeFixture(Body pBody, CRunMBase pMBase, int xp, int yp, short img, float density, float friction, float restitution, float scaleX, float scaleY)
    [javac] ^
    [javac] symbol: class CRunMBase
    [javac] location: class CRunBox2DBase
    [javac] C:\Users\Moucklee\AppData\Local\Temp\And1DD1.tmp\s rc\Extensions\CRunBox2DBase.java:1531: error: cannot find symbol
    [javac] public Fixture rBodyCreateShapeFixture(Body pBody, CRunMBase pMBase, int xp, int yp, short img, float density, float friction, float restitution, float scaleX, float scaleY)
    [javac] ^
    [javac] symbol: class Fixture
    [javac] location: class CRunBox2DBase
    [javac] C:\Users\Moucklee\AppData\Local\Temp\And1DD1.tmp\s rc\Extensions\CRunBox2DBase.java:1833: error: cannot find symbol
    [javac] public Body rCreateBullet(float angle, float speed, CRunMBase pMBase)
    [javac] ^
    [javac] symbol: class CRunMBase
    [javac] location: class CRunBox2DBase
    [javac] C:\Users\Moucklee\AppData\Local\Temp\And1DD1.tmp\s rc\Extensions\CRunBox2DBase.java:1833: error: cannot find symbol
    [javac] public Body rCreateBullet(float angle, float speed, CRunMBase pMBase)
    [javac] ^
    [javac] symbol: class Body
    [javac] location: class CRunBox2DBase
    [javac] C:\Users\Moucklee\AppData\Local\Temp\And1DD1.tmp\s rc\Extensions\CRunBox2DBase.java:1856: error: cannot find symbol
    [javac] public void rBodyResetMassData(Body pBody)
    [javac] ^
    [javac] symbol: class Body
    [javac] location: class CRunBox2DBase
    [javac] C:\Users\Moucklee\AppData\Local\Temp\And1DD1.tmp\s rc\Extensions\CRunBox2DBase.java:1860: error: cannot find symbol
    [javac] public void rBodySetTransform(Body pBody, Vector2 position, float angle)
    [javac] ^
    [javac] symbol: class Body
    [javac] location: class CRunBox2DBase
    [javac] C:\Users\Moucklee\AppData\Local\Temp\And1DD1.tmp\s rc\Extensions\CRunBox2DBase.java:1860: error: cannot find symbol
    [javac] public void rBodySetTransform(Body pBody, Vector2 position, float angle)
    [javac] ^
    [javac] symbol: class Vector2
    [javac] location: class CRunBox2DBase
    [javac] C:\Users\Moucklee\AppData\Local\Temp\And1DD1.tmp\s rc\Extensions\CRunBox2DBase.java:1864: error: cannot find symbol
    [javac] public void rDestroyJoint(Joint joint)
    [javac] ^
    [javac] symbol: class Joint
    [javac] location: class CRunBox2DBase
    [javac] C:\Users\Moucklee\AppData\Local\Temp\And1DD1.tmp\s rc\Extensions\CRunBox2DBase.java:1868: error: cannot find symbol
    [javac] public void rGetBodyPosition(Body pBody, CRunBox2DBasePosAndAngle o)
    [javac] ^
    [javac] symbol: class Body
    [javac] location: class CRunBox2DBase
    [javac] C:\Users\Moucklee\AppData\Local\Temp\And1DD1.tmp\s rc\Extensions\CRunBox2DBase.java:1945: error: cannot find symbol
    [javac] public Fixture rBodyCreatePlatformFixture(Body pBody, CRunMBase pMBase, short img, int vertical, float density, float friction, float restitution, CRunBox2DBaseImageDimension o, float scaleX, float scaleY, float maskWidth)
    [javac] ^
    [javac] symbol: class Body
    [javac] location: class CRunBox2DBase
    [javac] C:\Users\Moucklee\AppData\Local\Temp\And1DD1.tmp\s rc\Extensions\CRunBox2DBase.java:1945: error: cannot find symbol
    [javac] public Fixture rBodyCreatePlatformFixture(Body pBody, CRunMBase pMBase, short img, int vertical, float density, float friction, float restitution, CRunBox2DBaseImageDimension o, float scaleX, float scaleY, float maskWidth)
    [javac] ^
    [javac] symbol: class CRunMBase
    [javac] location: class CRunBox2DBase
    [javac] C:\Users\Moucklee\AppData\Local\Temp\And1DD1.tmp\s rc\Extensions\CRunBox2DBase.java:1945: error: cannot find symbol
    [javac] public Fixture rBodyCreatePlatformFixture(Body pBody, CRunMBase pMBase, short img, int vertical, float density, float friction, float restitution, CRunBox2DBaseImageDimension o, float scaleX, float scaleY, float maskWidth)
    [javac] ^
    [javac] symbol: class Fixture
    [javac] location: class CRunBox2DBase
    [javac] C:\Users\Moucklee\AppData\Local\Temp\And1DD1.tmp\s rc\Extensions\CRunBox2DBase.java:2431: error: cannot find symbol
    [javac] public void preSolve(Contact contact, Manifold oldManifold)
    [javac] ^
    [javac] symbol: class Contact
    [javac] location: class CContactListener
    [javac] C:\Users\Moucklee\AppData\Local\Temp\And1DD1.tmp\s rc\Extensions\CRunBox2DBase.java:2431: error: cannot find symbol
    [javac] public void preSolve(Contact contact, Manifold oldManifold)
    [javac] ^
    [javac] symbol: class Manifold
    [javac] location: class CContactListener
    [javac] C:\Users\Moucklee\AppData\Local\Temp\And1DD1.tmp\s rc\Extensions\CRunBox2DBase.java:2928: error: cannot find symbol
    [javac] public void beginContact(Contact c)
    [javac] ^
    [javac] symbol: class Contact
    [javac] location: class CContactListener
    [javac] C:\Users\Moucklee\AppData\Local\Temp\And1DD1.tmp\s rc\Extensions\CRunBox2DBase.java:2931: error: cannot find symbol
    [javac] public void endContact(Contact c)
    [javac] ^
    [javac] symbol: class Contact
    [javac] location: class CContactListener
    [javac] C:\Users\Moucklee\AppData\Local\Temp\And1DD1.tmp\s rc\Extensions\CRunBox2DBase.java:2935: error: cannot find symbol
    [javac] public void postSolve(Contact c, ContactImpulse ci)
    [javac] ^
    [javac] symbol: class Contact
    [javac] location: class CContactListener
    [javac] C:\Users\Moucklee\AppData\Local\Temp\And1DD1.tmp\s rc\Extensions\CRunBox2DBase.java:2935: error: cannot find symbol
    [javac] public void postSolve(Contact c, ContactImpulse ci)
    [javac] ^
    [javac] symbol: class ContactImpulse
    [javac] location: class CContactListener
    [javac] C:\Users\Moucklee\AppData\Local\Temp\And1DD1.tmp\s rc\Extensions\CRunBox2DBase.java:2359: error: cannot find symbol
    [javac] public Body m_body;
    [javac] ^
    [javac] symbol: class Body
    [javac] location: class CForce
    [javac] C:\Users\Moucklee\AppData\Local\Temp\And1DD1.tmp\s rc\Extensions\CRunBox2DBase.java:2360: error: cannot find symbol
    [javac] public Vector2 m_force;
    [javac] ^
    [javac] symbol: class Vector2
    [javac] location: class CForce
    [javac] C:\Users\Moucklee\AppData\Local\Temp\And1DD1.tmp\s rc\Extensions\CRunBox2DBase.java:2365: error: cannot find symbol
    [javac] public CForce(Body body, Vector2 force)
    [javac] ^
    [javac] symbol: class Body
    [javac] location: class CForce
    [javac] C:\Users\Moucklee\AppData\Local\Temp\And1DD1.tmp\s rc\Extensions\CRunBox2DBase.java:2365: error: cannot find symbol
    [javac] public CForce(Body body, Vector2 force)
    [javac] ^
    [javac] symbol: class Vector2
    [javac] location: class CForce
    [javac] C:\Users\Moucklee\AppData\Local\Temp\And1DD1.tmp\s rc\Extensions\CRunBox2DBase.java:2373: error: cannot find symbol
    [javac] public Body m_body;
    [javac] ^
    [javac] symbol: class Body
    [javac] location: class CTorque
    [javac] C:\Users\Moucklee\AppData\Local\Temp\And1DD1.tmp\s rc\Extensions\CRunBox2DBase.java:2379: error: cannot find symbol
    [javac] public CTorque(Body body, float torque)
    [javac] ^
    [javac] symbol: class Body
    [javac] location: class CTorque
    [javac] C:\Users\Moucklee\AppData\Local\Temp\And1DD1.tmp\s rc\Extensions\CRunBox2DBase.java:2391: error: cannot find symbol
    [javac] public Joint m_joint;
    [javac] ^
    [javac] symbol: class Joint
    [javac] location: class CJoint
    [javac] C:\Users\Moucklee\AppData\Local\Temp\And1DD1.tmp\s rc\Extensions\CRunBox2DBase.java:2405: error: cannot find symbol
    [javac] public void SetJoint(int type, Joint joint)
    [javac] ^
    [javac] symbol: class Joint
    [javac] location: class CJoint
    [javac] C:\Users\Moucklee\AppData\Local\Temp\And1DD1.tmp\s rc\Extensions\CRunBox2DBaseElementParent.java:3: error: cannot find symbol
    [javac] import RunLoop.CRunMBase;
    [javac] ^
    [javac] symbol: class CRunMBase
    [javac] location: package RunLoop
    [javac] C:\Users\Moucklee\AppData\Local\Temp\And1DD1.tmp\s rc\Extensions\CRunBox2DBaseElementParent.java:7: error: cannot find symbol
    [javac] public class CRunBox2DBaseElementParent extends CRunMBase
    [javac] ^
    [javac] symbol: class CRunMBase
    [javac] C:\Users\Moucklee\AppData\Local\Temp\And1DD1.tmp\s rc\Extensions\CRunBox2DBaseParent.java:12: error: package com.badlogic.gdx.physics.box2d does not exist
    [javac] import com.badlogic.gdx.physics.box2d.Body;
    [javac] ^
    [javac] C:\Users\Moucklee\AppData\Local\Temp\And1DD1.tmp\s rc\Extensions\CRunBox2DBaseParent.java:17: error: cannot find symbol
    [javac] public class CRunBox2DBaseParent extends CRunBaseParent
    [javac] ^
    [javac] symbol: class CRunBaseParent
    [javac] C:\Users\Moucklee\AppData\Local\Temp\And1DD1.tmp\s rc\Extensions\CRunBox2DBaseParent.java:137: error: cannot find symbol
    [javac] public void rAddObject(CRunMBase mBase)
    [javac] ^
    [javac] symbol: class CRunMBase
    [javac] location: class CRunBox2DBaseParent
    [javac] C:\Users\Moucklee\AppData\Local\Temp\And1DD1.tmp\s rc\Extensions\CRunBox2DBaseParent.java:141: error: cannot find symbol
    [javac] public void rRemoveObject(CRunMBase mBase)
    [javac] ^
    [javac] symbol: class CRunMBase
    [javac] location: class CRunBox2DBaseParent
    [javac] C:\Users\Moucklee\AppData\Local\Temp\And1DD1.tmp\s rc\Extensions\CRunBox2DBaseParent.java:145: error: cannot find symbol
    [javac] public Body rCreateBullet(float angle, float speed, CRunMBase pMBase)
    [javac] ^
    [javac] symbol: class CRunMBase
    [javac] location: class CRunBox2DBaseParent
    [javac] C:\Users\Moucklee\AppData\Local\Temp\And1DD1.tmp\s rc\Extensions\CRunBox2DBaseParent.java:145: error: cannot find symbol
    [javac] public Body rCreateBullet(float angle, float speed, CRunMBase pMBase)
    [javac] ^
    [javac] symbol: class Body
    [javac] location: class CRunBox2DBaseParent
    [javac] C:\Users\Moucklee\AppData\Local\Temp\And1DD1.tmp\s rc\Extensions\CRunBox2DBaseParent.java:149: error: cannot find symbol
    [javac] public void rDestroyBody(Body body)
    [javac] ^
    [javac] symbol: class Body
    [javac] location: class CRunBox2DBaseParent
    [javac] C:\Users\Moucklee\AppData\Local\Temp\And1DD1.tmp\s rc\Movements\CRunMvtbox2dstatic.java:33: error: cannot find symbol
    [javac] import RunLoop.CRunMBase;
    [javac] ^
    [javac] symbol: class CRunMBase
    [javac] location: package RunLoop
    [javac] C:\Users\Moucklee\AppData\Local\Temp\And1DD1.tmp\s rc\Movements\CRunMvtbox2dstatic.java:36: error: package com.badlogic.gdx.math does not exist
    [javac] import com.badlogic.gdx.math.MathUtils;
    [javac] ^
    [javac] C:\Users\Moucklee\AppData\Local\Temp\And1DD1.tmp\s rc\Movements\CRunMvtbox2dstatic.java:37: error: package com.badlogic.gdx.math does not exist
    [javac] import com.badlogic.gdx.math.Vector2;
    [javac] ^
    [javac] C:\Users\Moucklee\AppData\Local\Temp\And1DD1.tmp\s rc\Movements\CRunMvtbox2dstatic.java:38: error: package com.badlogic.gdx.physics.box2d does not exist
    [javac] import com.badlogic.gdx.physics.box2d.BodyDef;
    [javac] ^
    [javac] C:\Users\Moucklee\AppData\Local\Temp\And1DD1.tmp\s rc\Movements\CRunMvtbox2dstatic.java:39: error: package com.badlogic.gdx.physics.box2d does not exist
    [javac] import com.badlogic.gdx.physics.box2d.Fixture;
    [javac] ^
    [javac] C:\Users\Moucklee\AppData\Local\Temp\And1DD1.tmp\s rc\Movements\CRunMvtbox2dstatic.java:41: error: cannot find symbol
    [javac] public class CRunMvtbox2dstatic extends CRunMBase
    [javac] ^
    [javac] symbol: class CRunMBase
    [javac] C:\Users\Moucklee\AppData\Local\Temp\And1DD1.tmp\s rc\Movements\CRunMvtbox2dstatic.java:59: error: cannot find symbol
    [javac] public Fixture m_fixture = null;
    [javac] ^
    [javac] symbol: class Fixture
    [javac] location: class CRunMvtbox2dstatic
    [javac] C:\Users\Moucklee\AppData\Local\Temp\And1DD1.tmp\s rc\Movements\CRMvt.java:143: error: incompatible types: CRunMvtbox2dstatic cannot be converted to CRunMvtExtension
    [javac] object=new CRunMvtbox2dstatic();
    [javac] ^
    [javac] Note: C:\Users\Moucklee\AppData\Local\Temp\And1DD1.tmp\s rc\Extensions\CRunOUYA.java uses or overrides a deprecated API.
    [javac] Note: Recompile with -Xlint:deprecation for details.
    [javac] Note: C:\Users\Moucklee\AppData\Local\Temp\And1DD1.tmp\s rc\Extensions\CRunMultipleTouch.java uses unchecked or unsafe operations.
    [javac] Note: Recompile with -Xlint:unchecked for details.
    [javac] 100 errors
    [javac] 3 warnings

    BUILD FAILED
    C:\Android\tools\ant\build.xml:720: The following error occurred while executing this line:
    C:\Android\tools\ant\build.xml:734: Compile failed; see the compiler error output for details.

    Total time: 4 seconds


    J'ai une autre erreur je sais pas comment la résoudre

  6. #6
    Clickteam Clickteam
    Fernando's Avatar
    Join Date
    Dec 2006
    Posts
    5,909
    Mentioned
    116 Post(s)
    Tagged
    2 Thread(s)
    Hi,

    seems to be a installation problem, can you reinstall android exporter again and test?
    Regards,


    Fernando Vivolo

    ... new things are coming ...

  7. #7
    Clicker Fusion 2.5 DeveloperFusion 2.5 DeveloperAndroid Export ModuleHTML5 Export ModuleiOS Export ModuleSWF Export ModuleMac Export Module

    Join Date
    Jun 2014
    Location
    France
    Posts
    151
    Mentioned
    0 Post(s)
    Tagged
    0 Thread(s)
    Hi Fernando Ty for u Repost


    Yes i can in one hour

  8. #8
    Clicker Fusion 2.5 DeveloperFusion 2.5 DeveloperAndroid Export ModuleHTML5 Export ModuleiOS Export ModuleSWF Export ModuleMac Export Module

    Join Date
    Jun 2014
    Location
    France
    Posts
    151
    Mentioned
    0 Post(s)
    Tagged
    0 Thread(s)
    It's good I managed a compiler thanks you Fernando

  9. #9
    Clicker Fusion 2.5 DeveloperAndroid Export ModuleSWF Export Module

    Join Date
    Mar 2014
    Posts
    5
    Mentioned
    0 Post(s)
    Tagged
    0 Thread(s)
    Bonjour,

    J'ai aussi un problème d'export sur le module android (pour un programme tout simple de test avec l'objet android) mais sans message d'erreur : au moment de lancer et construire le programme android (apk), l'ordinateur travaille mais ne s'arrete pas (boucle infini).
    Si je recupere le fichier apk qui a une certaine taille (en forcant l'arrete de Fusion Developper 2.5) sur mon telephone, je peux pas l'installer (il y a une erreur sur mon telephone pour l'installer "Erreur d'analyse").
    Mon environnement : Windows 7 64bits, Clickteam Fusion Developper 2.5 (build R282.3), module android pour Fusion Developper (*.282.0.140705.exe).
    java jdk1.7.0_71 (32bits) et Android SDK manager revision 23.0.5.

    API de construction 14
    version android 3.2.
    Ce qui est etonnant c'est qu'il fait bien le lien entre java et android car si je changer une api par une api non installé dans SDK manager j'ai bien alors un message d'erreur (ce qui est normal).

    Merci de bien vouloir m'aider
    Bien cordialement
    Christophe

  10. #10
    Clickteam Clickteam

    Join Date
    Jun 2006
    Location
    France
    Posts
    12,839
    Mentioned
    83 Post(s)
    Tagged
    2 Thread(s)
    Lorsque le programme se bloque lors d'un "Construire et Lancer" c'est en général du à un problème de l'outil adb du SDK Android qui n'arrive pas à trouver l'appareil, soit parce que le pilote n'est pas compatible ADB (la plupart du temps), soit parce que l'option Déboggage USB n'est pas cochée dans les Options Développeur dans les paramètres de l'appareil, soit parce qu'il y a plusieurs appareils branchés, soit parce qu'il y a plusieur adb qui tournent.

    Pour le débloquer il faut lancer le gestionnaires de tâches de Windows et terminer les tâches "adb". Et si ça le refait, voir les points cités plus haut. C'est quel appareil?

    Sinon il est possible faire simplement construire le fichier APK puis de le transférer sur l'appareil manuellement et ensuite de l'installer avec un outil fait pour ça (du genre APK Installer, un gestionnaire de fichiers comme File Expert, etc).

Page 1 of 2 1 2 LastLast

Similar Threads

  1. Can't build apps anymore!
    By EdSabbath in forum Android Export Module Version 2.0
    Replies: 2
    Last Post: 6th September 2012, 11:52 AM
  2. Cant open Apps I build
    By SeanmanX in forum Multimedia Fusion 2 - Technical Support
    Replies: 2
    Last Post: 17th July 2009, 07:48 PM

Posting Permissions

  • You may not post new threads
  • You may not post replies
  • You may not post attachments
  • You may not edit your posts
  •