User Tag List

Results 1 to 7 of 7

Thread: Can't compile

  1. #1
    Clicker Fusion 2.5Android Export Module

    Join Date
    Oct 2013
    Posts
    4
    Mentioned
    0 Post(s)
    Tagged
    0 Thread(s)

    Can't compile

    Hello,
    I'm very new in Android dev and I have a problem a can't compile.
    I copy the error log:

    -compile:
    [javac] Compiling 374 source files to C:\Users\VPCEC1~1\AppData\Local\Temp\AndCBF7.tmp\b in\classes
    [javac] warning: [options] source value 1.5 is obsolete and will be removed in a future release
    [javac] warning: [options] target value 1.5 is obsolete and will be removed in a future release
    [javac] warning: [options] To suppress warnings about obsolete options, use -Xlint:-options.
    [javac] C:\Users\VPCEC1~1\AppData\Local\Temp\AndCBF7.tmp\s rc\Extensions\CRunInputType.java:436: error: cannot find symbol
    [javac] if(ViewExt instanceof CRunkcedit) {
    [javac] ^
    [javac] symbol: class CRunkcedit
    [javac] location: class CRunInputType
    [javac] C:\Users\VPCEC1~1\AppData\Local\Temp\AndCBF7.tmp\s rc\Extensions\CRunInputType.java:437: error: cannot find symbol
    [javac] CRunkcedit edit = ((CRunkcedit)ViewExt);
    [javac] ^
    [javac] symbol: class CRunkcedit
    [javac] location: class CRunInputType
    [javac] C:\Users\VPCEC1~1\AppData\Local\Temp\AndCBF7.tmp\s rc\Extensions\CRunInputType.java:437: error: cannot find symbol
    [javac] CRunkcedit edit = ((CRunkcedit)ViewExt);
    [javac] ^
    [javac] symbol: class CRunkcedit
    [javac] location: class CRunInputType
    [javac] Note: Some input files use or override a deprecated API.
    [javac] Note: Recompile with -Xlint:deprecation for details.
    [javac] Note: Some input files use unchecked or unsafe operations.
    [javac] Note: Recompile with -Xlint:unchecked for details.
    [javac] 3 errors
    [javac] 3 warnings

    BUILD FAILED
    C:\SDK Android\sdk\tools\ant\build.xml:720: The following error occurred while executing this line:
    C:\SDK Android\sdk\tools\ant\build.xml:734: Compile failed; see the compiler error output for details.

    Total time: 9 seconds
    Thanks!

  2. #2
    Clickteam Clickteam
    Fernando's Avatar
    Join Date
    Dec 2006
    Posts
    6,333
    Mentioned
    209 Post(s)
    Tagged
    4 Thread(s)
    sorry try the last nightly build inside product onwer´s lounge, look something wrong copy
    Regards,


    Fernando Vivolo

    ... new things are coming ...

  3. #3
    Clicker Fusion 2.5Android Export Module

    Join Date
    Oct 2013
    Posts
    4
    Mentioned
    0 Post(s)
    Tagged
    0 Thread(s)
    Thanks.
    I tested the latest build but now then I try to compile Fusion hangs and nothing happens.

  4. #4
    Clickteam Clickteam
    Fernando's Avatar
    Join Date
    Dec 2006
    Posts
    6,333
    Mentioned
    209 Post(s)
    Tagged
    4 Thread(s)
    are you sure you have connection to your devices, can you open a command window and execute "adb devices" (without quotes) and tell me your results.
    Regards,


    Fernando Vivolo

    ... new things are coming ...

  5. #5
    Clicker Fusion 2.5Android Export Module

    Join Date
    Oct 2013
    Posts
    4
    Mentioned
    0 Post(s)
    Tagged
    0 Thread(s)
    AH ok!! I didn't know that I have to connect my device! I thought Fusion copile the game and run it through the emulator.
    I'll test this tonight when I'm at home.
    Thanks!

  6. #6
    Clicker Fusion 2.5Android Export Module

    Join Date
    Oct 2013
    Posts
    4
    Mentioned
    0 Post(s)
    Tagged
    0 Thread(s)
    Have tested but nothing happens.
    Here is a screen from the adb device cmd.
    Sans titre.jpg

    Thanks for your help!

  7. #7
    Clickteam Clickteam
    Fernando's Avatar
    Join Date
    Dec 2006
    Posts
    6,333
    Mentioned
    209 Post(s)
    Tagged
    4 Thread(s)
    no device is attached, check that your emulator or devices are showing in this list, Fusion only allow one device connected at the time you are building.

    if not you need to download with sdk the google usb driver and installed in your machine, after that also verify that the device is settled for development.

    https://dl.dropboxusercontent.com/u/...stallation.pdf
    Regards,


    Fernando Vivolo

    ... new things are coming ...

Similar Threads

  1. RSS, can't compile....
    By Javira in forum SWF/Flash Export Module Version 2.0
    Replies: 4
    Last Post: 25th June 2012, 10:08 PM
  2. How to compile for something other than .exe
    By rubes in forum Multimedia Fusion 2 - Technical Support
    Replies: 3
    Last Post: 14th June 2011, 01:42 PM
  3. Server .exe Compile
    By Machina12 in forum Multimedia Fusion 2 - Technical Support
    Replies: 6
    Last Post: 23rd May 2007, 10:46 PM
  4. Compile for me?
    By Illyria05 in forum Multimedia Fusion 2 - Technical Support
    Replies: 1
    Last Post: 7th December 2006, 12:36 AM

Posting Permissions

  • You may not post new threads
  • You may not post replies
  • You may not post attachments
  • You may not edit your posts
  •