User Tag List

Page 3 of 4 FirstFirst 1 2 3 4 LastLast
Results 21 to 30 of 31

Thread: Build Failed during compile

  1. #21
    Clicker Fusion 2.5 (Steam)Fusion 2.5 Developer (Steam)Android Export Module (Steam)HTML5 Export Module (Steam)iOS Export Module (Steam)

    Join Date
    Feb 2015
    Posts
    17
    Mentioned
    0 Post(s)
    Tagged
    0 Thread(s)
    I will put different sounds on certain channels now because that sounds like it'll really help.

    I did not use the Android Object to get the Folder for the application. I have just left it as how Windows and browsers handle the INI. I will look into this too, thanks.

  2. #22
    Clicker Fusion 2.5 DeveloperAndroid Export ModuleSWF Export Module

    Join Date
    Dec 2013
    Posts
    12
    Mentioned
    0 Post(s)
    Tagged
    0 Thread(s)
    Hi, can anyone help with the below...

    Buildfile: C:\Users\NICK'S~1\AppData\Local\Temp\And3E14.tmp\b uild.xml

    -set-mode-check:

    -set-debug-files:

    -check-env:
    [checkenv] Android SDK Tools Revision 24.1.2
    [checkenv] Installed at C:\Program Files (x86)\Android

    -setup:
    [echo] Project Name: RuntimeAndroid
    [gettype] Project Type: Application

    -set-debug-mode:

    -debug-obfuscation-check:

    -pre-build:

    -build-setup:
    [getbuildtools] Using latest Build Tools: 22.0.1
    [echo] Resolving Build Target for RuntimeAndroid...
    [gettarget] Project Target: Android 4.4.2
    [gettarget] API level: 19
    [echo] ----------
    [echo] Creating output directories if needed...
    [mkdir] Created dir: C:\Users\NICK'S~1\AppData\Local\Temp\And3E14.tmp\b in
    [mkdir] Created dir: C:\Users\NICK'S~1\AppData\Local\Temp\And3E14.tmp\b in\res
    [mkdir] Created dir: C:\Users\NICK'S~1\AppData\Local\Temp\And3E14.tmp\b in\rsObj
    [mkdir] Created dir: C:\Users\NICK'S~1\AppData\Local\Temp\And3E14.tmp\b in\rsLibs
    [mkdir] Created dir: C:\Users\NICK'S~1\AppData\Local\Temp\And3E14.tmp\g en
    [mkdir] Created dir: C:\Users\NICK'S~1\AppData\Local\Temp\And3E14.tmp\b in\classes
    [mkdir] Created dir: C:\Users\NICK'S~1\AppData\Local\Temp\And3E14.tmp\b in\dexedLibs
    [echo] ----------
    [echo] Resolving Dependencies for RuntimeAndroid...
    [dependency] Library dependencies:
    [dependency] No Libraries
    [dependency]
    [dependency] ------------------
    [echo] ----------
    [echo] Building Libraries with 'debug'...
    [subant] No sub-builds to iterate on

    -code-gen:
    [mergemanifest] Merging AndroidManifest files into one.
    [mergemanifest] Manifest merger disabled. Using project manifest only.
    [echo] Handling aidl files...
    [aidl] No AIDL files to compile.
    [echo] ----------
    [echo] Handling RenderScript files...
    [echo] ----------
    [echo] Handling Resources...
    [aapt] Generating resource IDs...
    [echo] ----------
    [echo] Handling BuildConfig class...
    [buildconfig] Generating BuildConfig class.

    -pre-compile:

    -compile:
    [javac] Compiling 345 source files to C:\Users\NICK'S~1\AppData\Local\Temp\And3E14.tmp\b in\classes
    [javac] javac: invalid flag: C:\Users\NICK
    [javac] Usage: javac <options> <source files>
    [javac] use -help for a list of possible options

    BUILD FAILED
    C:\Program Files (x86)\Android\tools\ant\build.xml:720: The following error occurred while executing this line:
    C:\Program Files (x86)\Android\tools\ant\build.xml:734: Compile failed; see the compiler error output for details.

    Total time: 3 seconds

    I've got java installed at

    C:\Program Files (x86)\Java\jdk1.6.0_33

    and android installed at

    C:\Program Files (x86)\Android

    with API19 installed in the SDK manager, and the API set to 19 on the android options on CF2.5

    Any help would be greatly appreciated.

    Thanks,

    Nick.

  3. #23
    Forum Moderator

    Fusion 2.5 MacFusion 2.5 DeveloperFusion 2.5+ DLCAndroid Export ModuleHTML5 Export ModuleiOS Export ModuleUniversal Windows Platform Export ModuleSWF Export ModuleMac Export ModuleInstall Creator Pro
    Fusion 2.5 (Steam)Fusion 2.5 Developer (Steam)Android Export Module (Steam)HTML5 Export Module (Steam)iOS Export Module (Steam)
    Perry's Avatar
    Join Date
    Dec 2013
    Location
    Watertown, WI
    Posts
    4,355
    Mentioned
    53 Post(s)
    Tagged
    0 Thread(s)
    Do you have the built tool for API 19 installed?
    Looks like it's trying to use Built tool 22 instead of 19

  4. #24
    Clicker Fusion 2.5 DeveloperAndroid Export ModuleSWF Export Module

    Join Date
    Dec 2013
    Posts
    12
    Mentioned
    0 Post(s)
    Tagged
    0 Thread(s)
    I've set the API number to 19 in the Android settings, and have installed API 19 in the SDK Manager (which I've also un-installed and re-installed), but am still getting the same error

  5. #25
    Clickteam Clickteam

    Join Date
    Jun 2006
    Location
    France
    Posts
    13,324
    Mentioned
    154 Post(s)
    Tagged
    2 Thread(s)
    Maybe it's due to the quote in your user name?

  6. #26
    Forum Moderator

    Fusion 2.5 MacFusion 2.5 DeveloperFusion 2.5+ DLCAndroid Export ModuleHTML5 Export ModuleiOS Export ModuleUniversal Windows Platform Export ModuleSWF Export ModuleMac Export ModuleInstall Creator Pro
    Fusion 2.5 (Steam)Fusion 2.5 Developer (Steam)Android Export Module (Steam)HTML5 Export Module (Steam)iOS Export Module (Steam)
    Perry's Avatar
    Join Date
    Dec 2013
    Location
    Watertown, WI
    Posts
    4,355
    Mentioned
    53 Post(s)
    Tagged
    0 Thread(s)
    Did you check in the SDK manager, all the way at the top. there are the Built tools (Those are separate from the API's)
    Do you have the 19 tool checked ?


    [getbuildtools] Using latest Build Tools: 22.0.1
    [gettarget] API level: 19

  7. #27
    Clicker Fusion 2.5 DeveloperAndroid Export ModuleSWF Export Module

    Join Date
    Dec 2013
    Posts
    12
    Mentioned
    0 Post(s)
    Tagged
    0 Thread(s)
    Thanks, it seems sorted now (I created a new user account called Admin and compiled it from in that account), managed to get the .apk file created on the desktop then mailed over and installed onto the tablet.

    I'm just trying the build and run option now, got the tablet connected with USB debugging enabled, it's taking forever though. The green compile bar is complete but CF2.5 is just hanging there! (been a few minutes now!).

    Any ideas?

    Thanks,

    Nick.

  8. #28
    Forum Moderator

    Fusion 2.5 MacFusion 2.5 DeveloperFusion 2.5+ DLCAndroid Export ModuleHTML5 Export ModuleiOS Export ModuleUniversal Windows Platform Export ModuleSWF Export ModuleMac Export ModuleInstall Creator Pro
    Fusion 2.5 (Steam)Fusion 2.5 Developer (Steam)Android Export Module (Steam)HTML5 Export Module (Steam)iOS Export Module (Steam)
    Perry's Avatar
    Join Date
    Dec 2013
    Location
    Watertown, WI
    Posts
    4,355
    Mentioned
    53 Post(s)
    Tagged
    0 Thread(s)
    yeah... doesn't work.. for a long time..
    it used to work, but there are 2 processes running, and when you quit 1 of them, then it's done, but nothing is there.
    so I just copy the file on the phone, or e-mail it my phone/tablet.

  9. #29
    Clicker Fusion 2.5 DeveloperAndroid Export ModuleSWF Export Module

    Join Date
    Dec 2013
    Posts
    12
    Mentioned
    0 Post(s)
    Tagged
    0 Thread(s)
    Thanks all

  10. #30
    Clickteam Clickteam

    Join Date
    Jun 2006
    Location
    France
    Posts
    13,324
    Mentioned
    154 Post(s)
    Tagged
    2 Thread(s)
    Yes it's usually a driver issue, you need an ADB-compatible driver. If you can't find one you have to transfer and install your APK manually to your phone.

Page 3 of 4 FirstFirst 1 2 3 4 LastLast

Similar Threads

  1. Build Failed
    By xhedgehogx in forum iOS Export Module 2.5
    Replies: 2
    Last Post: 25th September 2014, 12:46 AM
  2. build failed (sometimes)
    By gagegage926 in forum Android Export Module 2.5
    Replies: 9
    Last Post: 14th August 2014, 09:21 AM
  3. BUILD FAILED
    By gregoire0 in forum Android Export Module Version 2.0
    Replies: 3
    Last Post: 18th April 2013, 05:05 PM
  4. Build failed
    By Farhan in forum Android Export Module Version 2.0
    Replies: 4
    Last Post: 9th April 2013, 07:09 PM
  5. [RC7] BUILD FAILED
    By Pharanygitis in forum Android Export Module Version 2.0
    Replies: 7
    Last Post: 29th March 2013, 02:44 PM

Tags for this Thread

Posting Permissions

  • You may not post new threads
  • You may not post replies
  • You may not post attachments
  • You may not edit your posts
  •