User Tag List

Results 1 to 8 of 8

Thread: Build process fails with error message 'cannot build blah.mfa

  1. #1
    Clicker Fusion 2.5Android Export ModuleHTML5 Export ModuleInstall Creator Pro

    Join Date
    May 2011
    Location
    California
    Posts
    190
    Mentioned
    0 Post(s)
    Tagged
    0 Thread(s)

    Build process fails with error message 'cannot build blah.mfa

    Should've been blah.apk on subject line...

    This the entire message of the build failed document:
    I'm pretty good at using software and figuring out error messages.
    But I'm stomped. What does all this mean?
    I don't know what to correct.

    Note that I'm just trying to run this through the emulator.
    Which works just fine btw.
    Both the App API and Emulator Test API are matching 19.
    Also note that I'm not finished with the APP I'm trying to create.
    All I'm trying to do is make a working template I can use as a road map.
    Maybe someone can tell me how I can fix and build my app to get it to work in the Emulator.
    Thanks in advance for all your help.

    Buildfile: C:\Users\Klik\AppData\Local\Temp\And977.tmp\build. xml

    -set-mode-check:

    -set-release-mode:

    -release-obfuscation-check:
    [echo] proguard.config is ${proguard.config}

    -pre-build:

    -check-env:
    [checkenv] Android SDK Tools Revision 24.2.0
    [checkenv] Installed at C:\Program Files (x86)\Android\android-sdk

    -setup:
    [echo] Project Name: RuntimeAndroid
    [gettype] Project Type: Application

    -build-setup:
    [getbuildtools] Using latest Build Tools: 22.0.1
    [echo] Resolving Build Target for RuntimeAndroid...
    [gettarget] Project Target: Android 4.4.2
    [gettarget] API level: 19
    [echo] ----------
    [echo] Creating output directories if needed...
    [mkdir] Created dir: C:\Users\Klik\AppData\Local\Temp\And977.tmp\bin
    [mkdir] Created dir: C:\Users\Klik\AppData\Local\Temp\And977.tmp\bin\re s
    [mkdir] Created dir: C:\Users\Klik\AppData\Local\Temp\And977.tmp\bin\rs Obj
    [mkdir] Created dir: C:\Users\Klik\AppData\Local\Temp\And977.tmp\bin\rs Libs
    [mkdir] Created dir: C:\Users\Klik\AppData\Local\Temp\And977.tmp\gen
    [mkdir] Created dir: C:\Users\Klik\AppData\Local\Temp\And977.tmp\bin\cl asses
    [mkdir] Created dir: C:\Users\Klik\AppData\Local\Temp\And977.tmp\bin\de xedLibs
    [echo] ----------
    [echo] Resolving Dependencies for RuntimeAndroid...
    [dependency] Library dependencies:
    [dependency] No Libraries
    [dependency]
    [dependency] ------------------
    [echo] ----------
    [echo] Building Libraries with 'release'...
    [subant] No sub-builds to iterate on

    -code-gen:
    [mergemanifest] Merging AndroidManifest files into one.
    [mergemanifest] Manifest merger disabled. Using project manifest only.
    [echo] Handling aidl files...
    [aidl] No AIDL files to compile.
    [echo] ----------
    [echo] Handling RenderScript files...
    [echo] ----------
    [echo] Handling Resources...
    [aapt] Generating resource IDs...
    [aapt] C:\Users\Klik\AppData\Local\Temp\And977.tmp\res\va lues\strings.xml:3: error: Error parsing XML: not well-formed (invalid token)
    [aapt]

    BUILD FAILED
    C:\Program Files (x86)\Android\android-sdk\tools\ant\build.xml:653: The following error occurred while executing this line:
    C:\Program Files (x86)\Android\android-sdk\tools\ant\build.xml:698: null returned: 1

    Total time: 0 seconds

  2. #2
    Clicker Fusion 2.5Android Export ModuleHTML5 Export ModuleInstall Creator Pro

    Join Date
    May 2011
    Location
    California
    Posts
    190
    Mentioned
    0 Post(s)
    Tagged
    0 Thread(s)
    BUILD FAILED
    C:\Program Files (x86)\Android\android-sdk\tools\ant\build.xml:653: The following error occurred while executing this line:
    C:\Program Files (x86)\Android\android-sdk\tools\ant\build.xml:698: null returned: 1

    This is where the build fails at. I search info for this on alternate sites but I can find anything to solve the the problem. I made this work before. But I forgot what I did.

  3. #3
    Clickteam Clickteam

    Join Date
    Jun 2006
    Location
    France
    Posts
    13,697
    Mentioned
    235 Post(s)
    Tagged
    3 Thread(s)
    What's the name of your application and application package?

  4. #4
    Clicker Fusion 2.5Android Export ModuleHTML5 Export ModuleInstall Creator Pro

    Join Date
    May 2011
    Location
    California
    Posts
    190
    Mentioned
    0 Post(s)
    Tagged
    0 Thread(s)
    name of application: Ultra Bat & Ball
    name of application package: ultrabatball.apk

    Here's the MFA. I didn't program it or anything. I'm not done adding stuff yet. I just want to get it set up to work with android emulator.
    Attached files Attached files

  5. #5
    Clickteam Clickteam

    Join Date
    Jun 2006
    Location
    France
    Posts
    13,697
    Mentioned
    235 Post(s)
    Tagged
    3 Thread(s)
    I mean the package name in the Android properties of the application, IIRC it can cause problems if you use special characters.

  6. #6
    Clicker Fusion 2.5Android Export ModuleHTML5 Export ModuleInstall Creator Pro

    Join Date
    May 2011
    Location
    California
    Posts
    190
    Mentioned
    0 Post(s)
    Tagged
    0 Thread(s)
    I uploaded the file but the name I put was:
    com.robsremotestgames.ultrabatandball

  7. #7
    Clickteam Clickteam
    Jeff's Avatar
    Join Date
    Jun 2006
    Location
    Battle Ground Washington
    Posts
    11,824
    Mentioned
    8 Post(s)
    Tagged
    2 Thread(s)
    You need to get rid of the & sign in the Application name and in the APK file your building.

  8. #8
    Clicker Fusion 2.5Android Export ModuleHTML5 Export ModuleInstall Creator Pro

    Join Date
    May 2011
    Location
    California
    Posts
    190
    Mentioned
    0 Post(s)
    Tagged
    0 Thread(s)
    Okay now it works. Thanks Jeff

Similar Threads

  1. Build process fails with error message 'Invalid keystore format'
    By Anton in forum Android Export Module 2.5
    Replies: 7
    Last Post: 4th February 2015, 11:58 PM
  2. Build fails no error message - Old Device
    By DaveC in forum Android Export Module 2.5
    Replies: 3
    Last Post: 19th August 2014, 02:53 AM
  3. android build and run freezes Fusion 2.5 (no error message)
    By brett in forum Android Export Module 2.5
    Replies: 4
    Last Post: 15th March 2014, 07:45 PM
  4. [Build Error Message] RC1
    By ProdigyX in forum Android Export Module Version 2.0
    Replies: 0
    Last Post: 10th October 2012, 07:16 PM
  5. Error message on build
    By Drcooper in forum Multimedia Fusion 2 - Technical Support
    Replies: 14
    Last Post: 4th January 2011, 10:39 PM

Posting Permissions

  • You may not post new threads
  • You may not post replies
  • You may not post attachments
  • You may not edit your posts
  •