User Tag List

Results 1 to 8 of 8

Thread: Error when creating apk file

  1. #1
    No Products Registered Fusion 2.5 (Steam)Android Export Module (Steam)

    Join Date
    Nov 2015
    Posts
    6
    Mentioned
    0 Post(s)
    Tagged
    0 Thread(s)

    Question Error when creating apk file

    When I try to create the apk file found this error:
    D:\Hobbies\SDK\tools\ant\build.xml:716: The following error occurred while executing this line:
    D:\Hobbies\SDK\tools\ant\build.xml:730: Compile failed; see the compiler error output for details.
    Who can help?

  2. #2
    Clickteam Clickteam
    Fernando's Avatar
    Join Date
    Dec 2006
    Posts
    5,818
    Mentioned
    110 Post(s)
    Tagged
    2 Thread(s)
    you need to post the full error log to help you
    Regards,


    Fernando Vivolo

    ... new things are coming ...

  3. #3
    No Products Registered Fusion 2.5 (Steam)Android Export Module (Steam)

    Join Date
    Nov 2015
    Posts
    6
    Mentioned
    0 Post(s)
    Tagged
    0 Thread(s)
    It's too big to post it in 1 message

  4. #4
    No Products Registered Fusion 2.5 (Steam)Android Export Module (Steam)

    Join Date
    Nov 2015
    Posts
    6
    Mentioned
    0 Post(s)
    Tagged
    0 Thread(s)
    Buildfile: C:\Users\3EC2~1\AppData\Local\Temp\And66A4.tmp\bui ld.xml

    -set-mode-check:

    -set-debug-files:

    -check-env:
    [checkenv] Android SDK Tools Revision 24.4.1
    [checkenv] Installed at D:\Hobbies\SDK

    -setup:
    [echo] Project Name: RuntimeAndroid
    [gettype] Project Type: Application

    -set-debug-mode:

    -debug-obfuscation-check:

    -pre-build:

    -build-setup:
    [getbuildtools] Using latest Build Tools: 23.0.2
    [echo] Resolving Build Target for RuntimeAndroid...
    [gettarget] Project Target: Android 6.0
    [gettarget] API level: 23
    [echo] ----------
    [echo] Creating output directories if needed...
    [mkdir] Created dir: C:\Users\3EC2~1\AppData\Local\Temp\And66A4.tmp\bin
    [mkdir] Created dir: C:\Users\3EC2~1\AppData\Local\Temp\And66A4.tmp\bin \res
    [mkdir] Created dir: C:\Users\3EC2~1\AppData\Local\Temp\And66A4.tmp\bin \rsObj
    [mkdir] Created dir: C:\Users\3EC2~1\AppData\Local\Temp\And66A4.tmp\bin \rsLibs
    [mkdir] Created dir: C:\Users\3EC2~1\AppData\Local\Temp\And66A4.tmp\gen
    [mkdir] Created dir: C:\Users\3EC2~1\AppData\Local\Temp\And66A4.tmp\bin \classes
    [mkdir] Created dir: C:\Users\3EC2~1\AppData\Local\Temp\And66A4.tmp\bin \dexedLibs
    [echo] ----------
    [echo] Resolving Dependencies for RuntimeAndroid...
    [dependency] Library dependencies:
    [dependency] No Libraries
    [dependency]
    [dependency] ------------------
    [echo] ----------
    [echo] Building Libraries with 'debug'...
    [subant] No sub-builds to iterate on

    -code-gen:
    [mergemanifest] Merging AndroidManifest files into one.
    [mergemanifest] Manifest merger disabled. Using project manifest only.
    [echo] Handling aidl files...
    [aidl] No AIDL files to compile.
    [echo] ----------
    [echo] Handling RenderScript files...
    [echo] ----------
    [echo] Handling Resources...
    [aapt] Generating resource IDs...
    [echo] ----------
    [echo] Handling BuildConfig class...
    [buildconfig] Generating BuildConfig class.

  5. #5
    No Products Registered Fusion 2.5 (Steam)Android Export Module (Steam)

    Join Date
    Nov 2015
    Posts
    6
    Mentioned
    0 Post(s)
    Tagged
    0 Thread(s)
    -pre-compile:

    -compile:
    [javac] Compiling 377 source files to C:\Users\3EC2~1\AppData\Local\Temp\And66A4.tmp\bin \classes
    [javac] C:\Users\3EC2~1\AppData\Local\Temp\And66A4.tmp\src \Runtime\CrashReporter.java:24: error: package org.apache.http does not exist
    [javac] import org.apache.http.HttpResponse;
    [javac] ^
    [javac] C:\Users\3EC2~1\AppData\Local\Temp\And66A4.tmp\src \Runtime\CrashReporter.java:25: error: package org.apache.http does not exist
    [javac] import org.apache.http.NameValuePair;
    [javac] ^
    [javac] C:\Users\3EC2~1\AppData\Local\Temp\And66A4.tmp\src \Runtime\CrashReporter.java:26: error: package org.apache.http.client.entity does not exist
    [javac] import org.apache.http.client.entity.UrlEncodedFormEntity ;
    [javac] ^
    [javac] C:\Users\3EC2~1\AppData\Local\Temp\And66A4.tmp\src \Runtime\CrashReporter.java:27: error: package org.apache.http.client.methods does not exist
    [javac] import org.apache.http.client.methods.HttpPost;
    [javac] ^
    [javac] C:\Users\3EC2~1\AppData\Local\Temp\And66A4.tmp\src \Runtime\CrashReporter.java:28: error: package org.apache.http.impl.client does not exist
    [javac] import org.apache.http.impl.client.DefaultHttpClient;
    [javac] ^
    [javac] C:\Users\3EC2~1\AppData\Local\Temp\And66A4.tmp\src \Runtime\CrashReporter.java:30: error: cannot find symbol
    [javac] import org.apache.http.params.HttpProtocolParams;
    [javac] ^
    [javac] symbol: class HttpProtocolParams
    [javac] location: package org.apache.http.params
    [javac] C:\Users\3EC2~1\AppData\Local\Temp\And66A4.tmp\src \Runtime\CrashReporter.java:63: error: cannot find symbol
    [javac] ArrayList <NameValuePair> postData = new ArrayList <NameValuePair> ();
    [javac] ^
    [javac] symbol: class NameValuePair
    [javac] location: class CrashReporter
    [javac] C:\Users\3EC2~1\AppData\Local\Temp\And66A4.tmp\src \Runtime\CrashReporter.java:63: error: cannot find symbol
    [javac] ArrayList <NameValuePair> postData = new ArrayList <NameValuePair> ();
    [javac] ^
    [javac] symbol: class NameValuePair
    [javac] location: class CrashReporter
    [javac] C:\Users\3EC2~1\AppData\Local\Temp\And66A4.tmp\src \Runtime\CrashReporter.java:65: error: cannot find symbol
    [javac] postData.add(new NameValuePair()
    [javac] ^
    [javac] symbol: class NameValuePair
    [javac] location: class CrashReporter
    [javac] C:\Users\3EC2~1\AppData\Local\Temp\And66A4.tmp\src \Runtime\CrashReporter.java:95: error: cannot find symbol
    [javac] HttpPost post = new HttpPost ("http://bugs.clickteam.com/report.php");
    [javac] ^
    [javac] symbol: class HttpPost
    [javac] location: class CrashReporter
    [javac] C:\Users\3EC2~1\AppData\Local\Temp\And66A4.tmp\src \Runtime\CrashReporter.java:95: error: cannot find symbol
    [javac] HttpPost post = new HttpPost ("http://bugs.clickteam.com/report.php");
    [javac] ^
    [javac] symbol: class HttpPost
    [javac] location: class CrashReporter
    [javac] C:\Users\3EC2~1\AppData\Local\Temp\And66A4.tmp\src \Runtime\CrashReporter.java:99: error: cannot find symbol
    [javac] { post.setEntity (new UrlEncodedFormEntity (postData));
    [javac] ^
    [javac] symbol: class UrlEncodedFormEntity
    [javac] location: class CrashReporter
    [javac] C:\Users\3EC2~1\AppData\Local\Temp\And66A4.tmp\src \Runtime\CrashReporter.java:105: error: cannot find symbol
    [javac] DefaultHttpClient client = new DefaultHttpClient();
    [javac] ^
    [javac] symbol: class DefaultHttpClient
    [javac] location: class CrashReporter
    [javac] C:\Users\3EC2~1\AppData\Local\Temp\And66A4.tmp\src \Runtime\CrashReporter.java:105: error: cannot find symbol
    [javac] DefaultHttpClient client = new DefaultHttpClient();
    [javac] ^
    [javac] symbol: class DefaultHttpClient
    [javac] location: class CrashReporter
    [javac] C:\Users\3EC2~1\AppData\Local\Temp\And66A4.tmp\src \Runtime\CrashReporter.java:108: error: cannot find symbol
    [javac] HttpProtocolParams.setUseExpectContinue (params, false);
    [javac] ^
    [javac] symbol: variable HttpProtocolParams
    [javac] location: class CrashReporter
    [javac] C:\Users\3EC2~1\AppData\Local\Temp\And66A4.tmp\src \Runtime\CrashReporter.java:111: error: cannot find symbol
    [javac] HttpResponse response;
    [javac] ^
    [javac] symbol: class HttpResponse
    [javac] location: class CrashReporter
    [javac] C:\Users\3EC2~1\AppData\Local\Temp\And66A4.tmp\src \Runtime\MMFRuntime.java:1645: warning: non-varargs call of varargs method with inexact argument type for last parameter;
    [javac] Method m = c.getDeclaredMethod("disconnect", null);
    [javac] ^
    [javac] cast to Class<?> for a varargs call
    [javac] cast to Class<?>[] for a non-varargs call and to suppress this warning
    [javac] C:\Users\3EC2~1\AppData\Local\Temp\And66A4.tmp\src \Runtime\MMFRuntime.java:1646: warning: non-varargs call of varargs method with inexact argument type for last parameter;
    [javac] Object o = m.invoke(null, null);
    [javac] ^
    [javac] cast to Object for a varargs call
    [javac] cast to Object[] for a non-varargs call and to suppress this warning
    [javac] C:\Users\3EC2~1\AppData\Local\Temp\And66A4.tmp\src \Runtime\MMFRuntime.java:1660: warning: non-varargs call of varargs method with inexact argument type for last parameter;
    [javac] Method m = c.getDeclaredMethod("connect", null);
    [javac] ^
    [javac] cast to Class<?> for a varargs call
    [javac] cast to Class<?>[] for a non-varargs call and to suppress this warning
    [javac] C:\Users\3EC2~1\AppData\Local\Temp\And66A4.tmp\src \Runtime\MMFRuntime.java:1661: warning: non-varargs call of varargs method with inexact argument type for last parameter;
    [javac] Object o = m.invoke(null, null);
    [javac] ^
    [javac] cast to Object for a varargs call
    [javac] cast to Object[] for a non-varargs call and to suppress this warning
    [javac] C:\Users\3EC2~1\AppData\Local\Temp\And66A4.tmp\src \Runtime\MMFRuntime.java:1675: warning: non-varargs call of varargs method with inexact argument type for last parameter;
    [javac] Method m = c.getDeclaredMethod("isConnected", null);
    [javac] ^
    [javac] cast to Class<?> for a varargs call
    [javac] cast to Class<?>[] for a non-varargs call and to suppress this warning
    [javac] C:\Users\3EC2~1\AppData\Local\Temp\And66A4.tmp\src \Runtime\MMFRuntime.java:1676: warning: non-varargs call of varargs method with inexact argument type for last parameter;
    [javac] Object o = m.invoke(null, null);
    [javac] ^
    [javac] cast to Object for a varargs call
    [javac] cast to Object[] for a non-varargs call and to suppress this warning
    [javac] Note: Some input files use or override a deprecated API.
    [javac] Note: Recompile with -Xlint:deprecation for details.
    [javac] Note: Some input files use unchecked or unsafe operations.
    [javac] Note: Recompile with -Xlint:unchecked for details.
    [javac] 16 errors
    [javac] 6 warnings

  6. #6
    No Products Registered Fusion 2.5 (Steam)Android Export Module (Steam)

    Join Date
    Nov 2015
    Posts
    6
    Mentioned
    0 Post(s)
    Tagged
    0 Thread(s)
    BUILD FAILED
    D:\Hobbies\SDK\tools\ant\build.xml:716: The following error occurred while executing this line:
    D:\Hobbies\SDK\tools\ant\build.xml:730: Compile failed; see the compiler error output for details.

    Total time: 2 seconds

  7. #7
    Clickteam Clickteam
    Jeff's Avatar
    Join Date
    Jun 2006
    Location
    Battle Ground Washington
    Posts
    11,817
    Mentioned
    6 Post(s)
    Tagged
    2 Thread(s)
    You don't want to use API 23
    Use API 22 or lower until the next update comes out.

  8. #8
    No Products Registered Fusion 2.5 (Steam)Android Export Module (Steam)

    Join Date
    Nov 2015
    Posts
    6
    Mentioned
    0 Post(s)
    Tagged
    0 Thread(s)
    Thanks Jeff

Similar Threads

  1. Creating a file without any extensions?
    By BartekB in forum Fusion 2.5
    Replies: 3
    Last Post: 31st March 2014, 01:20 PM
  2. Creating Object Error?
    By mr_mercury06uk in forum Multimedia Fusion 2 - Technical Support
    Replies: 1
    Last Post: 28th August 2013, 08:26 PM
  3. Problem with creating an exe file
    By CitrusMaster in forum The Games Factory 2 - Technical Support
    Replies: 2
    Last Post: 11th November 2012, 03:54 PM
  4. Creating your own file extension?
    By MikeB in forum Multimedia Fusion 2 - Technical Support
    Replies: 35
    Last Post: 11th May 2009, 01:55 AM
  5. "Error while opening file" with .exe file
    By Tiny in forum Multimedia Fusion 2 - Technical Support
    Replies: 9
    Last Post: 30th April 2007, 09:14 AM

Tags for this Thread

Posting Permissions

  • You may not post new threads
  • You may not post replies
  • You may not post attachments
  • You may not edit your posts
  •