User Tag List

Results 1 to 5 of 5

Thread: Android Export Error - Build Fails Every Time Between 4-5 sec

  1. #1
    Clicker Fusion 2.5Android Export Module
    henryhissagames's Avatar
    Join Date
    Dec 2014
    Posts
    63
    Mentioned
    0 Post(s)
    Tagged
    0 Thread(s)

    Android Export Error - Build Fails Every Time Between 4-5 sec

    I bought MMF2.5 with the android exporter more than a year ago, and I never experienced this problem. EVERY time that I try to export an .apk, when 4-5 seconds have passed there's an error, and it's always the same error. It begined to do this since I restarted my machine. This is the error log:

    --------------------------------------------------------------------------------------------------------------------------------------------------------------------------------

    Buildfile: C:\Users\Henrique\AppData\Local\Temp\And6630.tmp\b uild.xml


    -set-mode-check:


    -set-debug-files:


    -check-env:
    [checkenv] Android SDK Tools Revision 25.0.1
    [checkenv] Installed at C:\Users\Henrique\AppData\Local\Android\android-sdk


    -setup:
    [echo] Project Name: RuntimeAndroid
    [gettype] Project Type: Application


    -set-debug-mode:


    -debug-obfuscation-check:


    -pre-build:


    -build-setup:
    [getbuildtools] Using latest Build Tools: 23.0.2
    [echo] Resolving Build Target for RuntimeAndroid...
    [gettarget] Project Target: Android 6.0
    [gettarget] API level: 23
    [echo] ----------
    [echo] Creating output directories if needed...
    [mkdir] Created dir: C:\Users\Henrique\AppData\Local\Temp\And6630.tmp\b in
    [mkdir] Created dir: C:\Users\Henrique\AppData\Local\Temp\And6630.tmp\b in\res
    [mkdir] Created dir: C:\Users\Henrique\AppData\Local\Temp\And6630.tmp\b in\rsObj
    [mkdir] Created dir: C:\Users\Henrique\AppData\Local\Temp\And6630.tmp\b in\rsLibs
    [mkdir] Created dir: C:\Users\Henrique\AppData\Local\Temp\And6630.tmp\g en
    [mkdir] Created dir: C:\Users\Henrique\AppData\Local\Temp\And6630.tmp\b in\classes
    [mkdir] Created dir: C:\Users\Henrique\AppData\Local\Temp\And6630.tmp\b in\dexedLibs
    [echo] ----------
    [echo] Resolving Dependencies for RuntimeAndroid...
    [dependency] Library dependencies:
    [dependency] No Libraries
    [dependency]
    [dependency] ------------------
    [echo] ----------
    [echo] Building Libraries with 'debug'...
    [subant] No sub-builds to iterate on


    -code-gen:
    [mergemanifest] Merging AndroidManifest files into one.
    [mergemanifest] Manifest merger disabled. Using project manifest only.
    [echo] Handling aidl files...
    [aidl] No AIDL files to compile.
    [echo] ----------
    [echo] Handling RenderScript files...
    [echo] ----------
    [echo] Handling Resources...
    [aapt] Generating resource IDs...
    [echo] ----------
    [echo] Handling BuildConfig class...
    [buildconfig] Generating BuildConfig class.


    -pre-compile:


    -compile:
    [javac] Compiling 372 source files to C:\Users\Henrique\AppData\Local\Temp\And6630.tmp\b in\classes
    [javac] warning: [options] source value 1.5 is obsolete and will be removed in a future release
    [javac] warning: [options] target value 1.5 is obsolete and will be removed in a future release
    [javac] warning: [options] To suppress warnings about obsolete options, use -Xlint:-options.
    [javac] C:\Users\Henrique\AppData\Local\Temp\And6630.tmp\s rc\Runtime\CrashReporter.java:24: error: package org.apache.http does not exist
    [javac] import org.apache.http.HttpResponse;
    [javac] ^
    [javac] C:\Users\Henrique\AppData\Local\Temp\And6630.tmp\s rc\Runtime\CrashReporter.java:25: error: package org.apache.http does not exist
    [javac] import org.apache.http.NameValuePair;
    [javac] ^
    [javac] C:\Users\Henrique\AppData\Local\Temp\And6630.tmp\s rc\Runtime\CrashReporter.java:26: error: package org.apache.http.client.entity does not exist
    [javac] import org.apache.http.client.entity.UrlEncodedFormEntity ;
    [javac] ^
    [javac] C:\Users\Henrique\AppData\Local\Temp\And6630.tmp\s rc\Runtime\CrashReporter.java:27: error: package org.apache.http.client.methods does not exist
    [javac] import org.apache.http.client.methods.HttpPost;
    [javac] ^
    [javac] C:\Users\Henrique\AppData\Local\Temp\And6630.tmp\s rc\Runtime\CrashReporter.java:28: error: package org.apache.http.impl.client does not exist
    [javac] import org.apache.http.impl.client.DefaultHttpClient;
    [javac] ^
    [javac] C:\Users\Henrique\AppData\Local\Temp\And6630.tmp\s rc\Runtime\CrashReporter.java:30: error: cannot find symbol
    [javac] import org.apache.http.params.HttpProtocolParams;
    [javac] ^
    [javac] symbol: class HttpProtocolParams
    [javac] location: package org.apache.http.params
    [javac] C:\Users\Henrique\AppData\Local\Temp\And6630.tmp\s rc\Runtime\CrashReporter.java:63: error: cannot find symbol
    [javac] ArrayList <NameValuePair> postData = new ArrayList <NameValuePair> ();
    [javac] ^
    [javac] symbol: class NameValuePair
    [javac] location: class CrashReporter
    [javac] C:\Users\Henrique\AppData\Local\Temp\And6630.tmp\s rc\Runtime\CrashReporter.java:63: error: cannot find symbol
    [javac] ArrayList <NameValuePair> postData = new ArrayList <NameValuePair> ();
    [javac] ^
    [javac] symbol: class NameValuePair
    [javac] location: class CrashReporter
    [javac] C:\Users\Henrique\AppData\Local\Temp\And6630.tmp\s rc\Runtime\CrashReporter.java:65: error: cannot find symbol
    [javac] postData.add(new NameValuePair()
    [javac] ^
    [javac] symbol: class NameValuePair
    [javac] location: class CrashReporter
    [javac] C:\Users\Henrique\AppData\Local\Temp\And6630.tmp\s rc\Runtime\CrashReporter.java:95: error: cannot find symbol
    [javac] HttpPost post = new HttpPost ("http://bugs.clickteam.com/report.php");
    [javac] ^
    [javac] symbol: class HttpPost
    [javac] location: class CrashReporter
    [javac] C:\Users\Henrique\AppData\Local\Temp\And6630.tmp\s rc\Runtime\CrashReporter.java:95: error: cannot find symbol
    [javac] HttpPost post = new HttpPost ("http://bugs.clickteam.com/report.php");
    [javac] ^
    [javac] symbol: class HttpPost
    [javac] location: class CrashReporter
    [javac] C:\Users\Henrique\AppData\Local\Temp\And6630.tmp\s rc\Runtime\CrashReporter.java:99: error: cannot find symbol
    [javac] { post.setEntity (new UrlEncodedFormEntity (postData));
    [javac] ^
    [javac] symbol: class UrlEncodedFormEntity
    [javac] location: class CrashReporter
    [javac] C:\Users\Henrique\AppData\Local\Temp\And6630.tmp\s rc\Runtime\CrashReporter.java:105: error: cannot find symbol
    [javac] DefaultHttpClient client = new DefaultHttpClient();
    [javac] ^
    [javac] symbol: class DefaultHttpClient
    [javac] location: class CrashReporter
    [javac] C:\Users\Henrique\AppData\Local\Temp\And6630.tmp\s rc\Runtime\CrashReporter.java:105: error: cannot find symbol
    [javac] DefaultHttpClient client = new DefaultHttpClient();
    [javac] ^
    [javac] symbol: class DefaultHttpClient
    [javac] location: class CrashReporter
    [javac] C:\Users\Henrique\AppData\Local\Temp\And6630.tmp\s rc\Runtime\CrashReporter.java:108: error: cannot find symbol
    [javac] HttpProtocolParams.setUseExpectContinue (params, false);
    [javac] ^
    [javac] symbol: variable HttpProtocolParams
    [javac] location: class CrashReporter
    [javac] C:\Users\Henrique\AppData\Local\Temp\And6630.tmp\s rc\Runtime\CrashReporter.java:111: error: cannot find symbol
    [javac] HttpResponse response;
    [javac] ^
    [javac] symbol: class HttpResponse
    [javac] location: class CrashReporter
    [javac] Note: Some input files use or override a deprecated API.
    [javac] Note: Recompile with -Xlint:deprecation for details.
    [javac] Note: Some input files use unchecked or unsafe operations.
    [javac] Note: Recompile with -Xlint:unchecked for details.
    [javac] 16 errors
    [javac] 3 warnings


    BUILD FAILED
    C:\Users\Henrique\AppData\Local\Android\android-sdk\tools\ant\build.xml:716: The following error occurred while executing this line:
    C:\Users\Henrique\AppData\Local\Android\android-sdk\tools\ant\build.xml:730: Compile failed; see the compiler error output for details.


    Total time: 5 seconds

    --------------------------------------------------------------------------------------------------------------------------------------------------------------------------------

    Can somebody help me? Thanks, and Merry Christmas, and a happy New Year!!

  2. #2
    Clickteam Clickteam
    Fernando's Avatar
    Join Date
    Dec 2006
    Posts
    6,789
    Mentioned
    298 Post(s)
    Tagged
    4 Thread(s)
    you can not build using api 23 in this version you need to wait for next beta or release, stick to api 22 for now.

    Merry Xmas.
    Regards,


    Fernando Vivolo

    ... new things are coming ...

  3. #3
    Clicker Fusion 2.5Android Export Module
    henryhissagames's Avatar
    Join Date
    Dec 2014
    Posts
    63
    Mentioned
    0 Post(s)
    Tagged
    0 Thread(s)
    Thanks Fernando! And a happy New Year for you!

  4. #4
    Clicker Fusion 2.5Android Export Module

    Join Date
    Nov 2014
    Posts
    114
    Mentioned
    0 Post(s)
    Tagged
    0 Thread(s)
    Happy new year as well. I was looking for the solution to this problem.

  5. #5
    Clickteam Clickteam
    Jeff's Avatar
    Join Date
    Jun 2006
    Location
    Battle Ground Washington
    Posts
    11,825
    Mentioned
    8 Post(s)
    Tagged
    2 Thread(s)
    The current solution is to use API 22 or lower.

Similar Threads

  1. Android SDK Export error
    By alienayyy in forum Android Export Module 2.5
    Replies: 3
    Last Post: 19th October 2015, 08:38 PM
  2. Build process fails with error message 'cannot build blah.mfa
    By Jusfury in forum Android Export Module 2.5
    Replies: 7
    Last Post: 22nd May 2015, 08:16 PM
  3. Error of ChartBoost when iOS Export Module build
    By kt777 in forum iOS Export Module 2.5
    Replies: 2
    Last Post: 9th April 2015, 04:08 PM
  4. Build process fails with error message 'Invalid keystore format'
    By Anton in forum Android Export Module 2.5
    Replies: 7
    Last Post: 4th February 2015, 11:58 PM
  5. Build fails no error message - Old Device
    By DaveC in forum Android Export Module 2.5
    Replies: 3
    Last Post: 19th August 2014, 02:53 AM

Posting Permissions

  • You may not post new threads
  • You may not post replies
  • You may not post attachments
  • You may not edit your posts
  •