User Tag List

Results 1 to 4 of 4

Thread: Export Error and Cannot figure out what it means

  1. #1
    No Products Registered

    Join Date
    Jan 2015
    Posts
    6
    Mentioned
    0 Post(s)
    Tagged
    0 Thread(s)

    Export Error and Cannot figure out what it means

    Buildfile: C:\Users\Devin\AppData\Local\Temp\And5292.tmp\buil d.xml

    -set-mode-check:

    -set-release-mode:

    -release-obfuscation-check:
    [echo] proguard.config is ${proguard.config}

    -pre-build:

    -check-env:
    [checkenv] Android SDK Tools Revision 24.4.1
    [checkenv] Installed at C:\Users\Devin\AppData\Local\Android\android-sdk

    -setup:
    [echo] Project Name: RuntimeAndroid
    [gettype] Project Type: Application

    -build-setup:
    [getbuildtools] Using latest Build Tools: 23.0.2
    [echo] Resolving Build Target for RuntimeAndroid...
    [gettarget] Project Target: Android 6.0
    [gettarget] API level: 23
    [echo] ----------
    [echo] Creating output directories if needed...
    [mkdir] Created dir: C:\Users\Devin\AppData\Local\Temp\And5292.tmp\bin
    [mkdir] Created dir: C:\Users\Devin\AppData\Local\Temp\And5292.tmp\bin\ res
    [mkdir] Created dir: C:\Users\Devin\AppData\Local\Temp\And5292.tmp\bin\ rsObj
    [mkdir] Created dir: C:\Users\Devin\AppData\Local\Temp\And5292.tmp\bin\ rsLibs
    [mkdir] Created dir: C:\Users\Devin\AppData\Local\Temp\And5292.tmp\gen
    [mkdir] Created dir: C:\Users\Devin\AppData\Local\Temp\And5292.tmp\bin\ classes
    [mkdir] Created dir: C:\Users\Devin\AppData\Local\Temp\And5292.tmp\bin\ dexedLibs
    [echo] ----------
    [echo] Resolving Dependencies for RuntimeAndroid...
    [dependency] Library dependencies:
    [dependency] No Libraries
    [dependency]
    [dependency] ------------------
    [echo] ----------
    [echo] Building Libraries with 'release'...
    [subant] No sub-builds to iterate on

    -code-gen:
    [mergemanifest] Merging AndroidManifest files into one.
    [mergemanifest] Manifest merger disabled. Using project manifest only.
    [echo] Handling aidl files...
    [aidl] No AIDL files to compile.
    [echo] ----------
    [echo] Handling RenderScript files...
    [echo] ----------
    [echo] Handling Resources...
    [aapt] Generating resource IDs...
    [echo] ----------
    [echo] Handling BuildConfig class...
    [buildconfig] Generating BuildConfig class.

    -pre-compile:

    -compile:
    [javac] Compiling 436 source files to C:\Users\Devin\AppData\Local\Temp\And5292.tmp\bin\ classes
    [javac] warning: [options] source value 1.5 is obsolete and will be removed in a future release
    [javac] warning: [options] target value 1.5 is obsolete and will be removed in a future release
    [javac] warning: [options] To suppress warnings about obsolete options, use -Xlint:-options.
    [javac] C:\Users\Devin\AppData\Local\Temp\And5292.tmp\src\ Runtime\CrashReporter.java:24: error: package org.apache.http does not exist
    [javac] import org.apache.http.HttpResponse;
    [javac] ^
    [javac] C:\Users\Devin\AppData\Local\Temp\And5292.tmp\src\ Runtime\CrashReporter.java:25: error: package org.apache.http does not exist
    [javac] import org.apache.http.NameValuePair;
    [javac] ^
    [javac] C:\Users\Devin\AppData\Local\Temp\And5292.tmp\src\ Runtime\CrashReporter.java:26: error: package org.apache.http.client.entity does not exist
    [javac] import org.apache.http.client.entity.UrlEncodedFormEntity ;
    [javac] ^
    [javac] C:\Users\Devin\AppData\Local\Temp\And5292.tmp\src\ Runtime\CrashReporter.java:27: error: package org.apache.http.client.methods does not exist
    [javac] import org.apache.http.client.methods.HttpPost;
    [javac] ^
    [javac] C:\Users\Devin\AppData\Local\Temp\And5292.tmp\src\ Runtime\CrashReporter.java:28: error: package org.apache.http.impl.client does not exist
    [javac] import org.apache.http.impl.client.DefaultHttpClient;
    [javac] ^
    [javac] C:\Users\Devin\AppData\Local\Temp\And5292.tmp\src\ Runtime\CrashReporter.java:30: error: cannot find symbol
    [javac] import org.apache.http.params.HttpProtocolParams;
    [javac] ^
    [javac] symbol: class HttpProtocolParams
    [javac] location: package org.apache.http.params
    [javac] C:\Users\Devin\AppData\Local\Temp\And5292.tmp\src\ Runtime\CrashReporter.java:63: error: cannot find symbol
    [javac] ArrayList <NameValuePair> postData = new ArrayList <NameValuePair> ();
    [javac] ^
    [javac] symbol: class NameValuePair
    [javac] location: class CrashReporter
    [javac] C:\Users\Devin\AppData\Local\Temp\And5292.tmp\src\ Runtime\CrashReporter.java:63: error: cannot find symbol
    [javac] ArrayList <NameValuePair> postData = new ArrayList <NameValuePair> ();
    [javac] ^
    [javac] symbol: class NameValuePair
    [javac] location: class CrashReporter
    [javac] C:\Users\Devin\AppData\Local\Temp\And5292.tmp\src\ Runtime\CrashReporter.java:65: error: cannot find symbol
    [javac] postData.add(new NameValuePair()
    [javac] ^
    [javac] symbol: class NameValuePair
    [javac] location: class CrashReporter
    [javac] C:\Users\Devin\AppData\Local\Temp\And5292.tmp\src\ Runtime\CrashReporter.java:95: error: cannot find symbol
    [javac] HttpPost post = new HttpPost ();
    [javac] ^
    [javac] symbol: class HttpPost
    [javac] location: class CrashReporter
    [javac] C:\Users\Devin\AppData\Local\Temp\And5292.tmp\src\ Runtime\CrashReporter.java:95: error: cannot find symbol
    [javac] HttpPost post = new HttpPost ();
    [javac] ^
    [javac] symbol: class HttpPost
    [javac] location: class CrashReporter
    [javac] C:\Users\Devin\AppData\Local\Temp\And5292.tmp\src\ Runtime\CrashReporter.java:99: error: cannot find symbol
    [javac] { post.setEntity (new UrlEncodedFormEntity (postData));
    [javac] ^
    [javac] symbol: class UrlEncodedFormEntity
    [javac] location: class CrashReporter
    [javac] C:\Users\Devin\AppData\Local\Temp\And5292.tmp\src\ Runtime\CrashReporter.java:105: error: cannot find symbol
    [javac] DefaultHttpClient client = new DefaultHttpClient();
    [javac] ^
    [javac] symbol: class DefaultHttpClient
    [javac] location: class CrashReporter
    [javac] C:\Users\Devin\AppData\Local\Temp\And5292.tmp\src\ Runtime\CrashReporter.java:105: error: cannot find symbol
    [javac] DefaultHttpClient client = new DefaultHttpClient();
    [javac] ^
    [javac] symbol: class DefaultHttpClient
    [javac] location: class CrashReporter
    [javac] C:\Users\Devin\AppData\Local\Temp\And5292.tmp\src\ Runtime\CrashReporter.java:108: error: cannot find symbol
    [javac] HttpProtocolParams.setUseExpectContinue (params, false);
    [javac] ^
    [javac] symbol: variable HttpProtocolParams
    [javac] location: class CrashReporter
    [javac] C:\Users\Devin\AppData\Local\Temp\And5292.tmp\src\ Runtime\CrashReporter.java:111: error: cannot find symbol
    [javac] HttpResponse response;
    [javac] ^
    [javac] symbol: class HttpResponse
    [javac] location: class CrashReporter
    [javac] C:\Users\Devin\AppData\Local\Temp\And5292.tmp\src\ Runtime\MMFRuntime.java:1645: warning: non-varargs call of varargs method with inexact argument type for last parameter;
    [javac] Method m = c.getDeclaredMethod("disconnect", null);
    [javac] ^
    [javac] cast to Class<?> for a varargs call
    [javac] cast to Class<?>[] for a non-varargs call and to suppress this warning
    [javac] C:\Users\Devin\AppData\Local\Temp\And5292.tmp\src\ Runtime\MMFRuntime.java:1646: warning: non-varargs call of varargs method with inexact argument type for last parameter;
    [javac] Object o = m.invoke(null, null);
    [javac] ^
    [javac] cast to Object for a varargs call
    [javac] cast to Object[] for a non-varargs call and to suppress this warning
    [javac] C:\Users\Devin\AppData\Local\Temp\And5292.tmp\src\ Runtime\MMFRuntime.java:1660: warning: non-varargs call of varargs method with inexact argument type for last parameter;
    [javac] Method m = c.getDeclaredMethod("connect", null);
    [javac] ^
    [javac] cast to Class<?> for a varargs call
    [javac] cast to Class<?>[] for a non-varargs call and to suppress this warning
    [javac] C:\Users\Devin\AppData\Local\Temp\And5292.tmp\src\ Runtime\MMFRuntime.java:1661: warning: non-varargs call of varargs method with inexact argument type for last parameter;
    [javac] Object o = m.invoke(null, null);
    [javac] ^
    [javac] cast to Object for a varargs call
    [javac] cast to Object[] for a non-varargs call and to suppress this warning
    [javac] C:\Users\Devin\AppData\Local\Temp\And5292.tmp\src\ Runtime\MMFRuntime.java:1675: warning: non-varargs call of varargs method with inexact argument type for last parameter;
    [javac] Method m = c.getDeclaredMethod("isConnected", null);
    [javac] ^
    [javac] cast to Class<?> for a varargs call
    [javac] cast to Class<?>[] for a non-varargs call and to suppress this warning
    [javac] C:\Users\Devin\AppData\Local\Temp\And5292.tmp\src\ Runtime\MMFRuntime.java:1676: warning: non-varargs call of varargs method with inexact argument type for last parameter;
    [javac] Object o = m.invoke(null, null);
    [javac] ^
    [javac] cast to Object for a varargs call
    [javac] cast to Object[] for a non-varargs call and to suppress this warning
    [javac] Note: Some input files use or override a deprecated API.
    [javac] Note: Recompile with -Xlint:deprecation for details.
    [javac] Note: Some input files use unchecked or unsafe operations.
    [javac] Note: Recompile with -Xlint:unchecked for details.
    [javac] 16 errors
    [javac] 9 warnings

    BUILD FAILED
    C:\Users\Devin\AppData\Local\Android\android-sdk\tools\ant\build.xml:716: The following error occurred while executing this line:
    C:\Users\Devin\AppData\Local\Android\android-sdk\tools\ant\build.xml:730: Compile failed; see the compiler error output for details.

    Total time: 7 seconds

  2. #2
    No Products Registered

    Join Date
    Feb 2015
    Posts
    1
    Mentioned
    0 Post(s)
    Tagged
    0 Thread(s)
    Have you tried making an active in the first frame of your game and naming it "pingas"?

  3. #3
    No Products Registered

    Join Date
    Jan 2015
    Posts
    6
    Mentioned
    0 Post(s)
    Tagged
    0 Thread(s)
    God Dang it jfun, I need serious help and you created an account on these forums just so you could make another meme joke... I needed that

  4. #4
    Clickteam Clickteam
    Fernando's Avatar
    Join Date
    Dec 2006
    Posts
    5,747
    Mentioned
    99 Post(s)
    Tagged
    2 Thread(s)
    Welcome please check the forum first for help, your error is due that runtime build ok until API 22.
    Will be shortly a new version.
    Regards,


    Fernando Vivolo

    ... new things are coming ...

Similar Threads

  1. Android SDK Export error
    By alienayyy in forum Android Export Module 2.5
    Replies: 3
    Last Post: 19th October 2015, 08:38 PM
  2. don't know what this error means
    By WEich1213 in forum Multimedia Fusion 2 - Technical Support
    Replies: 2
    Last Post: 8th March 2014, 11:19 PM
  3. Flash export error
    By Keith in forum SWF/Flash Export Module Version 2.0
    Replies: 3
    Last Post: 19th August 2011, 04:06 AM
  4. SWF EXPORT ERROR
    By imothep85 in forum SWF/Flash Export Module Version 2.0
    Replies: 13
    Last Post: 25th September 2010, 03:39 AM
  5. Flash export error
    By Sumo in forum SWF/Flash Export Module Version 2.0
    Replies: 2
    Last Post: 26th August 2010, 02:42 AM

Tags for this Thread

Posting Permissions

  • You may not post new threads
  • You may not post replies
  • You may not post attachments
  • You may not edit your posts
  •