User Tag List

Results 1 to 7 of 7

Thread: Create by Name - Not working.

  1. #1
    Clicker

    Fusion 2.5 DeveloperFusion 2.5+ DLCAndroid Export ModuleHTML5 Export ModuleiOS Export Module
    AlanRuno's Avatar
    Join Date
    May 2013
    Posts
    334
    Mentioned
    1 Post(s)
    Tagged
    0 Thread(s)

    Create by Name - Not working.

    Im having issues using "Create by name" on the android runtime.
    Anyone has it working?

    Please help me

  2. #2
    Clickteam Clickteam
    Fernando's Avatar
    Join Date
    Dec 2006
    Posts
    6,076
    Mentioned
    137 Post(s)
    Tagged
    3 Thread(s)
    can you provide an example where the problem can be reproduced here?
    Regards,


    Fernando Vivolo

    ... new things are coming ...

  3. #3
    Clicker

    Fusion 2.5 DeveloperFusion 2.5+ DLCAndroid Export ModuleHTML5 Export ModuleiOS Export Module
    AlanRuno's Avatar
    Join Date
    May 2013
    Posts
    334
    Mentioned
    1 Post(s)
    Tagged
    0 Thread(s)
    Hey fernando!
    Thanks for the response!
    I managed to get it to work, looks like it was my mistake... with names of course hehe
    thank you for the fast response anyway!
    I like it how you're always helpful.
    thanks

  4. #4
    Clicker Multimedia Fusion 2 DeveloperiOS Export Module
    Fusion 2.5 (Steam)Fusion 2.5 Developer (Steam)Fusion 2.5+ DLC (Steam)Android Export Module (Steam)HTML5 Export Module (Steam)iOS Export Module (Steam)Universal Windows Platform Export Module (Steam)
    Guilherme's Avatar
    Join Date
    Dec 2010
    Location
    Brazil, São Paulo, SP
    Posts
    53
    Mentioned
    0 Post(s)
    Tagged
    0 Thread(s)
    Create by Name Not working!!!
    Not compile Android!
    Please help me

    CreateByName.mfa

  5. #5
    Clicker Multimedia Fusion 2 DeveloperiOS Export Module
    Fusion 2.5 (Steam)Fusion 2.5 Developer (Steam)Fusion 2.5+ DLC (Steam)Android Export Module (Steam)HTML5 Export Module (Steam)iOS Export Module (Steam)Universal Windows Platform Export Module (Steam)
    Guilherme's Avatar
    Join Date
    Dec 2010
    Location
    Brazil, São Paulo, SP
    Posts
    53
    Mentioned
    0 Post(s)
    Tagged
    0 Thread(s)
    Code:
    Buildfile: C:\Users\GUILHE~1\AppData\Local\Temp\And29E.tmp\build.xml
    
    -set-mode-check:
    
    
    -set-debug-files:
    
    
    -check-env:
     [checkenv] Android SDK Tools Revision 25.1.6
     [checkenv] Installed at C:\Program Files (x86)\Android\android-sdk
    
    
    -setup:
         [echo] Project Name: RuntimeAndroid
      [gettype] Project Type: Application
    
    
    -set-debug-mode:
    
    
    -debug-obfuscation-check:
    
    
    -pre-build:
    
    
    -build-setup:
    [getbuildtools] Using latest Build Tools: 23.0.3
         [echo] Resolving Build Target for RuntimeAndroid...
    [gettarget] Project Target:   Android 4.3.1
    [gettarget] API level:        18
         [echo] ----------
         [echo] Creating output directories if needed...
        [mkdir] Created dir: C:\Users\GUILHE~1\AppData\Local\Temp\And29E.tmp\bin
        [mkdir] Created dir: C:\Users\GUILHE~1\AppData\Local\Temp\And29E.tmp\bin\res
        [mkdir] Created dir: C:\Users\GUILHE~1\AppData\Local\Temp\And29E.tmp\bin\rsObj
        [mkdir] Created dir: C:\Users\GUILHE~1\AppData\Local\Temp\And29E.tmp\bin\rsLibs
        [mkdir] Created dir: C:\Users\GUILHE~1\AppData\Local\Temp\And29E.tmp\gen
        [mkdir] Created dir: C:\Users\GUILHE~1\AppData\Local\Temp\And29E.tmp\bin\classes
        [mkdir] Created dir: C:\Users\GUILHE~1\AppData\Local\Temp\And29E.tmp\bin\dexedLibs
         [echo] ----------
         [echo] Resolving Dependencies for RuntimeAndroid...
    [dependency] Library dependencies:
    [dependency] No Libraries
    [dependency] 
    [dependency] ------------------
         [echo] ----------
         [echo] Building Libraries with 'debug'...
       [subant] No sub-builds to iterate on
    
    
    -code-gen:
    [mergemanifest] Merging AndroidManifest files into one.
    [mergemanifest] Manifest merger disabled. Using project manifest only.
         [echo] Handling aidl files...
         [aidl] No AIDL files to compile.
         [echo] ----------
         [echo] Handling RenderScript files...
         [echo] ----------
         [echo] Handling Resources...
         [aapt] Generating resource IDs...
         [echo] ----------
         [echo] Handling BuildConfig class...
    [buildconfig] Generating BuildConfig class.
    
    
    -pre-compile:
    
    
    -compile:
        [javac] Compiling 371 source files to C:\Users\GUILHE~1\AppData\Local\Temp\And29E.tmp\bin\classes
        [javac] warning: [options] source value 1.5 is obsolete and will be removed in a future release
        [javac] warning: [options] target value 1.5 is obsolete and will be removed in a future release
        [javac] warning: [options] To suppress warnings about obsolete options, use -Xlint:-options.
        [javac] C:\Users\GUILHE~1\AppData\Local\Temp\And29E.tmp\src\Extensions\CRunCreateByName.java:170: error: cannot find symbol
        [javac]                     toadd.width = 1;
        [javac]                          ^
        [javac]   symbol:   variable width
        [javac]   location: variable toadd of type CBkd2
        [javac] C:\Users\GUILHE~1\AppData\Local\Temp\And29E.tmp\src\Extensions\CRunCreateByName.java:171: error: cannot find symbol
        [javac]                     toadd.height = 1;
        [javac]                          ^
        [javac]   symbol:   variable height
        [javac]   location: variable toadd of type CBkd2
        [javac] C:\Users\GUILHE~1\AppData\Local\Temp\And29E.tmp\src\Extensions\CRunCreateByName.java:174: error: cannot find symbol
        [javac]                         toadd.width = ifo.getWidth();
        [javac]                              ^
        [javac]   symbol:   variable width
        [javac]   location: variable toadd of type CBkd2
        [javac] C:\Users\GUILHE~1\AppData\Local\Temp\And29E.tmp\src\Extensions\CRunCreateByName.java:175: error: cannot find symbol
        [javac]                         toadd.height = ifo.getHeight();
        [javac]                              ^
        [javac]   symbol:   variable height
        [javac]   location: variable toadd of type CBkd2
        [javac] C:\Users\GUILHE~1\AppData\Local\Temp\And29E.tmp\src\Extensions\CRunCreateByName.java:178: error: cannot find symbol
        [javac]                         toadd.width = backdrop.ocCx;
        [javac]                              ^
        [javac]   symbol:   variable width
        [javac]   location: variable toadd of type CBkd2
        [javac] C:\Users\GUILHE~1\AppData\Local\Temp\And29E.tmp\src\Extensions\CRunCreateByName.java:179: error: cannot find symbol
        [javac]                         toadd.height = backdrop.ocCy;
        [javac]                              ^
        [javac]   symbol:   variable height
        [javac]   location: variable toadd of type CBkd2
        [javac] C:\Users\GUILHE~1\AppData\Local\Temp\And29E.tmp\src\Extensions\CRunCreateByName.java:201: error: cannot find symbol
        [javac]                             rh.rhFrame.colMask.fillRectangle(toadd.x, toadd.y, toadd.x+toadd.width, toadd.y+toadd.height, type);
        [javac]                                                                                             ^
        [javac]   symbol:   variable width
        [javac]   location: variable toadd of type CBkd2
        [javac] C:\Users\GUILHE~1\AppData\Local\Temp\And29E.tmp\src\Extensions\CRunCreateByName.java:201: error: cannot find symbol
        [javac]                             rh.rhFrame.colMask.fillRectangle(toadd.x, toadd.y, toadd.x+toadd.width, toadd.y+toadd.height, type);
        [javac]                                                                                                                  ^
        [javac]   symbol:   variable height
        [javac]   location: variable toadd of type CBkd2
        [javac] C:\Users\GUILHE~1\AppData\Local\Temp\And29E.tmp\src\Runtime\MMFRuntime.java:1645: warning: non-varargs call of varargs method with inexact argument type for last parameter;
        [javac]                 Method m = c.getDeclaredMethod("disconnect", null);
        [javac]                                                              ^
        [javac]   cast to Class<?> for a varargs call
        [javac]   cast to Class<?>[] for a non-varargs call and to suppress this warning
        [javac] C:\Users\GUILHE~1\AppData\Local\Temp\And29E.tmp\src\Runtime\MMFRuntime.java:1646: warning: non-varargs call of varargs method with inexact argument type for last parameter;
        [javac]                 Object o = m.invoke(null, null);
        [javac]                                           ^
        [javac]   cast to Object for a varargs call
        [javac]   cast to Object[] for a non-varargs call and to suppress this warning
        [javac] C:\Users\GUILHE~1\AppData\Local\Temp\And29E.tmp\src\Runtime\MMFRuntime.java:1660: warning: non-varargs call of varargs method with inexact argument type for last parameter;
        [javac]                 Method m = c.getDeclaredMethod("connect", null);
        [javac]                                                           ^
        [javac]   cast to Class<?> for a varargs call
        [javac]   cast to Class<?>[] for a non-varargs call and to suppress this warning
        [javac] C:\Users\GUILHE~1\AppData\Local\Temp\And29E.tmp\src\Runtime\MMFRuntime.java:1661: warning: non-varargs call of varargs method with inexact argument type for last parameter;
        [javac]                 Object o = m.invoke(null, null);
        [javac]                                           ^
        [javac]   cast to Object for a varargs call
        [javac]   cast to Object[] for a non-varargs call and to suppress this warning
        [javac] C:\Users\GUILHE~1\AppData\Local\Temp\And29E.tmp\src\Runtime\MMFRuntime.java:1675: warning: non-varargs call of varargs method with inexact argument type for last parameter;
        [javac]                 Method m = c.getDeclaredMethod("isConnected", null);
        [javac]                                                               ^
        [javac]   cast to Class<?> for a varargs call
        [javac]   cast to Class<?>[] for a non-varargs call and to suppress this warning
        [javac] C:\Users\GUILHE~1\AppData\Local\Temp\And29E.tmp\src\Runtime\MMFRuntime.java:1676: warning: non-varargs call of varargs method with inexact argument type for last parameter;
        [javac]                 Object o = m.invoke(null, null);
        [javac]                                           ^
        [javac]   cast to Object for a varargs call
        [javac]   cast to Object[] for a non-varargs call and to suppress this warning
        [javac] Note: Some input files use or override a deprecated API.
        [javac] Note: Recompile with -Xlint:deprecation for details.
        [javac] Note: Some input files use unchecked or unsafe operations.
        [javac] Note: Recompile with -Xlint:unchecked for details.
        [javac] 8 errors
        [javac] 9 warnings
    
    
    BUILD FAILED
    C:\Program Files (x86)\Android\android-sdk\tools\ant\build.xml:716: The following error occurred while executing this line:
    C:\Program Files (x86)\Android\android-sdk\tools\ant\build.xml:730: Compile failed; see the compiler error output for details.
    
    
    Total time: 13 seconds

  6. #6
    Clickteam Clickteam
    Jeff's Avatar
    Join Date
    Jun 2006
    Location
    Battle Ground Washington
    Posts
    11,822
    Mentioned
    7 Post(s)
    Tagged
    2 Thread(s)
    Hmmm --- Your MFA compiles here just fine for me.

    Are you using the latest beta version of Fusion? Maybe something was fixed in it for this object.

    Edit -- I see your on Steam so you can't but it should be coming out on Steam here in a week or 2.

  7. #7
    Clicker Multimedia Fusion 2 DeveloperiOS Export Module
    Fusion 2.5 (Steam)Fusion 2.5 Developer (Steam)Fusion 2.5+ DLC (Steam)Android Export Module (Steam)HTML5 Export Module (Steam)iOS Export Module (Steam)Universal Windows Platform Export Module (Steam)
    Guilherme's Avatar
    Join Date
    Dec 2010
    Location
    Brazil, São Paulo, SP
    Posts
    53
    Mentioned
    0 Post(s)
    Tagged
    0 Thread(s)
    Thanks Jeff, I'll be waiting.

Similar Threads

  1. Create on destroy working strangely
    By mobichan in forum Fusion 2.5
    Replies: 12
    Last Post: 25th November 2014, 08:02 AM
  2. Create Backdrop From Active Picture Not Working On IOS
    By virtualrom in forum iOS Export Module Version 2.0
    Replies: 3
    Last Post: 4th June 2014, 06:00 AM
  3. "Create new objects" doesn't create a physics object?
    By Literswater in forum Fusion 2.5
    Replies: 0
    Last Post: 12th May 2014, 08:42 PM
  4. Replies: 1
    Last Post: 14th April 2014, 09:01 AM
  5. How to create a working 3D game?
    By XStar in forum Multimedia Fusion 2 - Technical Support
    Replies: 35
    Last Post: 24th May 2012, 06:22 PM

Posting Permissions

  • You may not post new threads
  • You may not post replies
  • You may not post attachments
  • You may not edit your posts
  •