User Tag List

Page 1 of 2 1 2 LastLast
Results 1 to 10 of 16

Thread: Advanced Direction Error in Android Exporter

  1. #1
    Clicker Fusion 2.5 (Steam)Fusion 2.5 Developer (Steam)Android Export Module (Steam)HTML5 Export Module (Steam)

    Join Date
    May 2015
    Posts
    86
    Mentioned
    6 Post(s)
    Tagged
    0 Thread(s)

    Advanced Direction Error in Android Exporter

    Buildfile: C:\Users\miche\AppData\Local\Temp\AndFE5B.tmp\buil d.xml

    -set-mode-check:

    -set-release-mode:

    -release-obfuscation-check:
    [echo] proguard.config is ${proguard.config}

    -pre-build:

    -check-env:
    [checkenv] Android SDK Tools Revision 25.1.7
    [checkenv] Installed at C:\Program Files (x86)\Android\android-sdk

    -setup:
    [echo] Project Name: RuntimeAndroid
    [gettype] Project Type: Application

    -build-setup:
    [getbuildtools] Using latest Build Tools: 24.0.0
    [echo] Resolving Build Target for RuntimeAndroid...
    [gettarget] Project Target: Android N
    [gettarget] API level: 24
    [echo] ----------
    [echo] Creating output directories if needed...
    [mkdir] Created dir: C:\Users\miche\AppData\Local\Temp\AndFE5B.tmp\bin
    [mkdir] Created dir: C:\Users\miche\AppData\Local\Temp\AndFE5B.tmp\bin\ res
    [mkdir] Created dir: C:\Users\miche\AppData\Local\Temp\AndFE5B.tmp\bin\ rsObj
    [mkdir] Created dir: C:\Users\miche\AppData\Local\Temp\AndFE5B.tmp\bin\ rsLibs
    [mkdir] Created dir: C:\Users\miche\AppData\Local\Temp\AndFE5B.tmp\gen
    [mkdir] Created dir: C:\Users\miche\AppData\Local\Temp\AndFE5B.tmp\bin\ classes
    [mkdir] Created dir: C:\Users\miche\AppData\Local\Temp\AndFE5B.tmp\bin\ dexedLibs
    [echo] ----------
    [echo] Resolving Dependencies for RuntimeAndroid...
    [dependency] Library dependencies:
    [dependency] No Libraries
    [dependency]
    [dependency] ------------------
    [echo] ----------
    [echo] Building Libraries with 'release'...
    [subant] No sub-builds to iterate on

    -code-gen:
    [mergemanifest] Merging AndroidManifest files into one.
    [mergemanifest] Manifest merger disabled. Using project manifest only.
    [echo] Handling aidl files...
    [aidl] No AIDL files to compile.
    [echo] ----------
    [echo] Handling RenderScript files...
    [echo] ----------
    [echo] Handling Resources...
    [aapt] Generating resource IDs...
    [echo] ----------
    [echo] Handling BuildConfig class...
    [buildconfig] Generating BuildConfig class.

    -pre-compile:

    -compile:
    [javac] Compiling 479 source files to C:\Users\miche\AppData\Local\Temp\AndFE5B.tmp\bin\ classes
    [javac] warning: [options] source value 1.5 is obsolete and will be removed in a future release
    [javac] warning: [options] target value 1.5 is obsolete and will be removed in a future release
    [javac] warning: [options] To suppress warnings about obsolete options, use -Xlint:-options.
    [javac] C:\Users\miche\AppData\Local\Temp\AndFE5B.tmp\src\ Extensions\CRunAdvDir.java:174: error: incompatible types: CPositionInfo cannot be converted to PARAM_POSITION
    [javac] return CompDist(cnd.getParamPosition(rh, 0), cnd.getParamPosition(rh, 1), cnd.getParamExpression(rh, 2));
    [javac] ^
    [javac] C:\Users\miche\AppData\Local\Temp\AndFE5B.tmp\src\ Extensions\CRunAdvDir.java:176: error: incompatible types: CPositionInfo cannot be converted to PARAM_POSITION
    [javac] return CompDir(cnd.getParamPosition(rh, 0), cnd.getParamPosition(rh, 1), cnd.getParamExpression(rh, 2), cnd.getParamExpression(rh, 3));
    [javac] ^
    [javac] Note: Some input files use or override a deprecated API.
    [javac] Note: Recompile with -Xlint:deprecation for details.
    [javac] Note: Some input files use unchecked or unsafe operations.
    [javac] Note: Recompile with -Xlint:unchecked for details.
    [javac] Note: Some messages have been simplified; recompile with -Xdiags:verbose to get full output
    [javac] 2 errors
    [javac] 3 warnings

    BUILD FAILED
    C:\Program Files (x86)\Android\android-sdk\tools\ant\build.xml:716: The following error occurred while executing this line:
    C:\Program Files (x86)\Android\android-sdk\tools\ant\build.xml:730: Compile failed; see the compiler error output for details.

    Total time: 5 seconds

  2. #2
    Clickteam Clickteam
    Fernando's Avatar
    Join Date
    Dec 2006
    Posts
    6,171
    Mentioned
    166 Post(s)
    Tagged
    3 Thread(s)
    are you using the latest update from steam?
    Regards,


    Fernando Vivolo

    ... new things are coming ...

  3. #3
    Clicker Fusion 2.5 (Steam)Fusion 2.5 Developer (Steam)Android Export Module (Steam)HTML5 Export Module (Steam)

    Join Date
    May 2015
    Posts
    86
    Mentioned
    6 Post(s)
    Tagged
    0 Thread(s)
    All Extensions Update
    Android API 24 SDK
    Build R286.6 Developer

  4. #4
    Forum Moderator

    Fusion 2.5 MacFusion 2.5 DeveloperFusion 2.5+ DLCAndroid Export ModuleHTML5 Export ModuleiOS Export ModuleUniversal Windows Platform Export ModuleSWF Export ModuleMac Export ModuleInstall Creator Pro
    Fusion 2.5 (Steam)Fusion 2.5 Developer (Steam)Android Export Module (Steam)HTML5 Export Module (Steam)iOS Export Module (Steam)
    Perry's Avatar
    Join Date
    Dec 2013
    Location
    Watertown, WI
    Posts
    4,349
    Mentioned
    49 Post(s)
    Tagged
    0 Thread(s)
    What Jave Version are you using? Make sure that it is at least Version 8

  5. #5
    Clicker Fusion 2.5 (Steam)Fusion 2.5 Developer (Steam)Android Export Module (Steam)HTML5 Export Module (Steam)

    Join Date
    May 2015
    Posts
    86
    Mentioned
    6 Post(s)
    Tagged
    0 Thread(s)
    (Version 8 Update 101).

  6. #6
    Forum Moderator

    Fusion 2.5 MacFusion 2.5 DeveloperFusion 2.5+ DLCAndroid Export ModuleHTML5 Export ModuleiOS Export ModuleUniversal Windows Platform Export ModuleSWF Export ModuleMac Export ModuleInstall Creator Pro
    Fusion 2.5 (Steam)Fusion 2.5 Developer (Steam)Android Export Module (Steam)HTML5 Export Module (Steam)iOS Export Module (Steam)
    Perry's Avatar
    Join Date
    Dec 2013
    Location
    Watertown, WI
    Posts
    4,349
    Mentioned
    49 Post(s)
    Tagged
    0 Thread(s)
    Are you using things like Admob etc on your frames?
    idk if you have API 10/17 installed ?

  7. #7
    Clickteam Clickteam
    Fernando's Avatar
    Join Date
    Dec 2006
    Posts
    6,171
    Mentioned
    166 Post(s)
    Tagged
    3 Thread(s)
    Mm please put a bug report, I will check
    Regards,


    Fernando Vivolo

    ... new things are coming ...

  8. #8
    Clickteam Clickteam

    Join Date
    Jun 2006
    Location
    France
    Posts
    13,187
    Mentioned
    141 Post(s)
    Tagged
    2 Thread(s)
    This is a bug we have fixed recently. Reinstall the patch of the build 286, maybe you (re)installed the Advanced Direction object after installing the build 286 and we forgot to update the Android version of this object in the extension manager. I'll check.

    EDIT: I've sent you a PM with a quick update (as you use Steam).

  9. #9
    Clickteam Clickteam

    Join Date
    Jun 2006
    Location
    France
    Posts
    13,187
    Mentioned
    141 Post(s)
    Tagged
    2 Thread(s)
    Update: the object has been updated in the extension manager, just reinstall it, it should work now.

  10. #10
    Forum Moderator

    Fusion 2.5 MacFusion 2.5 DeveloperFusion 2.5+ DLCAndroid Export ModuleHTML5 Export ModuleiOS Export ModuleUniversal Windows Platform Export ModuleSWF Export ModuleMac Export ModuleInstall Creator Pro
    Fusion 2.5 (Steam)Fusion 2.5 Developer (Steam)Android Export Module (Steam)HTML5 Export Module (Steam)iOS Export Module (Steam)
    Perry's Avatar
    Join Date
    Dec 2013
    Location
    Watertown, WI
    Posts
    4,349
    Mentioned
    49 Post(s)
    Tagged
    0 Thread(s)
    Yves, I keep installing it in the manager, but it stays on top as Ready to install.. it doesn't move to the installed section. (287.2)

Page 1 of 2 1 2 LastLast

Similar Threads

  1. Replies: 56
    Last Post: 26th December 2017, 09:53 PM
  2. Error buildinf with android exporter pls help!!!!
    By AGX in forum Android Export Module 2.5
    Replies: 1
    Last Post: 8th January 2016, 05:30 PM
  3. Android Exporter Error when exporting
    By Keith in forum Android Export Module 2.5
    Replies: 1
    Last Post: 3rd January 2016, 08:34 AM
  4. Error installing Android Exporter with purchased 2.5
    By RhysD in forum Android Export Module Version 2.0
    Replies: 10
    Last Post: 13th December 2013, 05:44 PM

Posting Permissions

  • You may not post new threads
  • You may not post replies
  • You may not post attachments
  • You may not edit your posts
  •