User Tag List

Results 1 to 2 of 2

Thread: Export failed even in a Blank application

  1. #1
    No Products Registered

    Join Date
    Apr 2015
    Posts
    3
    Mentioned
    0 Post(s)
    Tagged
    0 Thread(s)

    Export failed even in a Blank application

    I've installed the Android SDK and JDK 8, the JDK and SDK directory is also right but I still get this error even in a Blank Application.

    Code:
    Buildfile: C:\Users\Bagus\AppData\Local\Temp\And1529.tmp\build.xml
    
    -set-mode-check:
    
    -set-debug-files:
    
    -check-env:
     [checkenv] Android SDK Tools Revision 25.2.2
     [checkenv] Installed at C:\Users\Bagus\AppData\Local\Android\sdk
    
    -setup:
         [echo] Project Name: RuntimeAndroid
      [gettype] Project Type: Application
    
    -set-debug-mode:
    
    -debug-obfuscation-check:
    
    -pre-build:
    
    -build-setup:
    [getbuildtools] Using latest Build Tools: 24.0.2
         [echo] Resolving Build Target for RuntimeAndroid...
    [gettarget] Project Target:   Android 7.0
    [gettarget] API level:        24
         [echo] ----------
         [echo] Creating output directories if needed...
        [mkdir] Created dir: C:\Users\Bagus\AppData\Local\Temp\And1529.tmp\bin
        [mkdir] Created dir: C:\Users\Bagus\AppData\Local\Temp\And1529.tmp\bin\res
        [mkdir] Created dir: C:\Users\Bagus\AppData\Local\Temp\And1529.tmp\bin\rsObj
        [mkdir] Created dir: C:\Users\Bagus\AppData\Local\Temp\And1529.tmp\bin\rsLibs
        [mkdir] Created dir: C:\Users\Bagus\AppData\Local\Temp\And1529.tmp\gen
        [mkdir] Created dir: C:\Users\Bagus\AppData\Local\Temp\And1529.tmp\bin\classes
        [mkdir] Created dir: C:\Users\Bagus\AppData\Local\Temp\And1529.tmp\bin\dexedLibs
         [echo] ----------
         [echo] Resolving Dependencies for RuntimeAndroid...
    [dependency] Library dependencies:
    [dependency] No Libraries
    [dependency] 
    [dependency] ------------------
         [echo] ----------
         [echo] Building Libraries with 'debug'...
       [subant] No sub-builds to iterate on
    
    -code-gen:
    [mergemanifest] Merging AndroidManifest files into one.
    [mergemanifest] Manifest merger disabled. Using project manifest only.
         [echo] Handling aidl files...
         [aidl] No AIDL files to compile.
         [echo] ----------
         [echo] Handling RenderScript files...
         [echo] ----------
         [echo] Handling Resources...
         [aapt] Generating resource IDs...
         [echo] ----------
         [echo] Handling BuildConfig class...
    [buildconfig] Generating BuildConfig class.
    
    -pre-compile:
    
    -compile:
        [javac] Compiling 370 source files to C:\Users\Bagus\AppData\Local\Temp\And1529.tmp\bin\classes
        [javac] warning: [options] source value 1.5 is obsolete and will be removed in a future release
        [javac] warning: [options] target value 1.5 is obsolete and will be removed in a future release
        [javac] warning: [options] To suppress warnings about obsolete options, use -Xlint:-options.
        [javac] C:\Users\Bagus\AppData\Local\Temp\And1529.tmp\src\Runtime\CrashReporter.java:24: error: package org.apache.http does not exist
        [javac] import org.apache.http.HttpResponse;
        [javac]                       ^
        [javac] C:\Users\Bagus\AppData\Local\Temp\And1529.tmp\src\Runtime\CrashReporter.java:25: error: package org.apache.http does not exist
        [javac] import org.apache.http.NameValuePair;
        [javac]                       ^
        [javac] C:\Users\Bagus\AppData\Local\Temp\And1529.tmp\src\Runtime\CrashReporter.java:26: error: package org.apache.http.client.entity does not exist
        [javac] import org.apache.http.client.entity.UrlEncodedFormEntity;
        [javac]                                     ^
        [javac] C:\Users\Bagus\AppData\Local\Temp\And1529.tmp\src\Runtime\CrashReporter.java:27: error: package org.apache.http.client.methods does not exist
        [javac] import org.apache.http.client.methods.HttpPost;
        [javac]                                      ^
        [javac] C:\Users\Bagus\AppData\Local\Temp\And1529.tmp\src\Runtime\CrashReporter.java:28: error: package org.apache.http.impl.client does not exist
        [javac] import org.apache.http.impl.client.DefaultHttpClient;
        [javac]                                   ^
        [javac] C:\Users\Bagus\AppData\Local\Temp\And1529.tmp\src\Runtime\CrashReporter.java:30: error: cannot find symbol
        [javac] import org.apache.http.params.HttpProtocolParams;
        [javac]                              ^
        [javac]   symbol:   class HttpProtocolParams
        [javac]   location: package org.apache.http.params
        [javac] C:\Users\Bagus\AppData\Local\Temp\And1529.tmp\src\Runtime\CrashReporter.java:63: error: cannot find symbol
        [javac]         ArrayList <NameValuePair> postData = new ArrayList <NameValuePair> ();
        [javac]                    ^
        [javac]   symbol:   class NameValuePair
        [javac]   location: class CrashReporter
        [javac] C:\Users\Bagus\AppData\Local\Temp\And1529.tmp\src\Runtime\CrashReporter.java:63: error: cannot find symbol
        [javac]         ArrayList <NameValuePair> postData = new ArrayList <NameValuePair> ();
        [javac]                                                             ^
        [javac]   symbol:   class NameValuePair
        [javac]   location: class CrashReporter
        [javac] C:\Users\Bagus\AppData\Local\Temp\And1529.tmp\src\Runtime\CrashReporter.java:65: error: cannot find symbol
        [javac]         postData.add(new NameValuePair()
        [javac]                          ^
        [javac]   symbol:   class NameValuePair
        [javac]   location: class CrashReporter
        [javac] C:\Users\Bagus\AppData\Local\Temp\And1529.tmp\src\Runtime\CrashReporter.java:95: error: cannot find symbol
        [javac]         HttpPost post = new HttpPost ("http://bugs.clickteam.com/report.php");
        [javac]         ^
        [javac]   symbol:   class HttpPost
        [javac]   location: class CrashReporter
        [javac] C:\Users\Bagus\AppData\Local\Temp\And1529.tmp\src\Runtime\CrashReporter.java:95: error: cannot find symbol
        [javac]         HttpPost post = new HttpPost ("http://bugs.clickteam.com/report.php");
        [javac]                             ^
        [javac]   symbol:   class HttpPost
        [javac]   location: class CrashReporter
        [javac] C:\Users\Bagus\AppData\Local\Temp\And1529.tmp\src\Runtime\CrashReporter.java:99: error: cannot find symbol
        [javac]         {   post.setEntity (new UrlEncodedFormEntity (postData));
        [javac]                                 ^
        [javac]   symbol:   class UrlEncodedFormEntity
        [javac]   location: class CrashReporter
        [javac] C:\Users\Bagus\AppData\Local\Temp\And1529.tmp\src\Runtime\CrashReporter.java:105: error: cannot find symbol
        [javac]         DefaultHttpClient client = new DefaultHttpClient();
        [javac]         ^
        [javac]   symbol:   class DefaultHttpClient
        [javac]   location: class CrashReporter
        [javac] C:\Users\Bagus\AppData\Local\Temp\And1529.tmp\src\Runtime\CrashReporter.java:105: error: cannot find symbol
        [javac]         DefaultHttpClient client = new DefaultHttpClient();
        [javac]                                        ^
        [javac]   symbol:   class DefaultHttpClient
        [javac]   location: class CrashReporter
        [javac] C:\Users\Bagus\AppData\Local\Temp\And1529.tmp\src\Runtime\CrashReporter.java:108: error: cannot find symbol
        [javac]         HttpProtocolParams.setUseExpectContinue (params, false);
        [javac]         ^
        [javac]   symbol:   variable HttpProtocolParams
        [javac]   location: class CrashReporter
        [javac] C:\Users\Bagus\AppData\Local\Temp\And1529.tmp\src\Runtime\CrashReporter.java:111: error: cannot find symbol
        [javac]         HttpResponse response;
        [javac]         ^
        [javac]   symbol:   class HttpResponse
        [javac]   location: class CrashReporter
        [javac] C:\Users\Bagus\AppData\Local\Temp\And1529.tmp\src\Runtime\MMFRuntime.java:1645: warning: non-varargs call of varargs method with inexact argument type for last parameter;
        [javac] 				Method m = c.getDeclaredMethod("disconnect", null);
        [javac] 				                                             ^
        [javac]   cast to Class<?> for a varargs call
        [javac]   cast to Class<?>[] for a non-varargs call and to suppress this warning
        [javac] C:\Users\Bagus\AppData\Local\Temp\And1529.tmp\src\Runtime\MMFRuntime.java:1646: warning: non-varargs call of varargs method with inexact argument type for last parameter;
        [javac] 				Object o = m.invoke(null, null);
        [javac] 				                          ^
        [javac]   cast to Object for a varargs call
        [javac]   cast to Object[] for a non-varargs call and to suppress this warning
        [javac] C:\Users\Bagus\AppData\Local\Temp\And1529.tmp\src\Runtime\MMFRuntime.java:1660: warning: non-varargs call of varargs method with inexact argument type for last parameter;
        [javac] 				Method m = c.getDeclaredMethod("connect", null);
        [javac] 				                                          ^
        [javac]   cast to Class<?> for a varargs call
        [javac]   cast to Class<?>[] for a non-varargs call and to suppress this warning
        [javac] C:\Users\Bagus\AppData\Local\Temp\And1529.tmp\src\Runtime\MMFRuntime.java:1661: warning: non-varargs call of varargs method with inexact argument type for last parameter;
        [javac] 				Object o = m.invoke(null, null);
        [javac] 				                          ^
        [javac]   cast to Object for a varargs call
        [javac]   cast to Object[] for a non-varargs call and to suppress this warning
        [javac] C:\Users\Bagus\AppData\Local\Temp\And1529.tmp\src\Runtime\MMFRuntime.java:1675: warning: non-varargs call of varargs method with inexact argument type for last parameter;
        [javac] 				Method m = c.getDeclaredMethod("isConnected", null);
        [javac] 				                                              ^
        [javac]   cast to Class<?> for a varargs call
        [javac]   cast to Class<?>[] for a non-varargs call and to suppress this warning
        [javac] C:\Users\Bagus\AppData\Local\Temp\And1529.tmp\src\Runtime\MMFRuntime.java:1676: warning: non-varargs call of varargs method with inexact argument type for last parameter;
        [javac] 				Object o = m.invoke(null, null);
        [javac] 				                          ^
        [javac]   cast to Object for a varargs call
        [javac]   cast to Object[] for a non-varargs call and to suppress this warning
        [javac] Note: Some input files use or override a deprecated API.
        [javac] Note: Recompile with -Xlint:deprecation for details.
        [javac] Note: Some input files use unchecked or unsafe operations.
        [javac] Note: Recompile with -Xlint:unchecked for details.
        [javac] 16 errors
        [javac] 9 warnings
    
    BUILD FAILED
    C:\Users\Bagus\AppData\Local\Android\sdk\tools\ant\build.xml:716: The following error occurred while executing this line:
    C:\Users\Bagus\AppData\Local\Android\sdk\tools\ant\build.xml:730: Compile failed; see the compiler error output for details.
    
    Total time: 6 seconds
    I would really like someone helps me. Thank you before..

  2. #2
    Clickteam Clickteam
    Fernando's Avatar
    Join Date
    Dec 2006
    Posts
    6,581
    Mentioned
    263 Post(s)
    Tagged
    4 Thread(s)
    this version seems outdated, which version you are installing?
    Regards,


    Fernando Vivolo

    ... new things are coming ...

Similar Threads

  1. Export Failed with Bouncing Ball Object
    By Daniel_M in forum Android Export Module 2.5
    Replies: 13
    Last Post: 11th May 2016, 07:54 PM
  2. Replies: 6
    Last Post: 16th June 2015, 05:39 PM
  3. iOS Xcode Build Failed Blank App
    By keeplisted in forum iOS Export Module 2.5
    Replies: 3
    Last Post: 3rd August 2014, 12:10 AM
  4. Build Failed even on Blank App
    By cannonball in forum Android Export Module 2.5
    Replies: 3
    Last Post: 7th July 2014, 01:35 PM
  5. Export Web application
    By Sphax in forum Multimedia Fusion 2 - Technical Support
    Replies: 5
    Last Post: 15th July 2006, 04:47 PM

Posting Permissions

  • You may not post new threads
  • You may not post replies
  • You may not post attachments
  • You may not edit your posts
  •