User Tag List

Page 1 of 6 1 2 3 ... LastLast
Results 1 to 10 of 57

Thread: error BUILD FAILED I have installed android exporter,java jdk 7, android sdk

  1. #1
    Clicker Fusion 2.5 DeveloperAndroid Export ModuleSWF Export Module

    Join Date
    Jun 2007
    Posts
    153
    Mentioned
    0 Post(s)
    Tagged
    0 Thread(s)

    error BUILD FAILED I have installed android exporter,java jdk 7, android sdk

    i get this error and the following log**


    Buildfile: C:\Users\dstroud\AppData\Local\Temp\AndC818.tmp\bu ild.xml

    BUILD FAILED
    C:\Users\dstroud\AppData\Local\Temp\AndC818.tmp\bu ild.xml:83: Cannot find C:\Users\dstroud\tools\ant\build.xml imported from C:\Users\dstroud\AppData\Local\Temp\AndC818.tmp\bu ild.xml

    Total time: 0 seconds

    **
    what is up?
    I have installed android exporter,java jdk 7, android sdk

  2. #2
    Clicker Fusion 2.5 DeveloperAndroid Export ModuleHTML5 Export ModuleiOS Export ModuleUniversal Windows Platform Export ModuleSWF Export Module
    Fusion 2.5 (Steam)Fusion 2.5 Developer (Steam)Android Export Module (Steam)HTML5 Export Module (Steam)iOS Export Module (Steam)Universal Windows Platform Export Module (Steam)
    DaveC's Avatar
    Join Date
    Jun 2007
    Location
    Perth, Australia
    Posts
    2,111
    Mentioned
    13 Post(s)
    Tagged
    0 Thread(s)
    Go Fusions preferences menu and there will a drop down for various exporters on one of the tabs (I'm not at my computer now so I can't check to see myself) you'll see Flash options Android in the drop down - select Android.

    Now there will be TWO paths - check that they are appropriately set (and make sure both paths aren't going to the same directory, this happened to mine once) I believe you need to link a path/directory to your installed SDK and to your installed Java.

  3. #3
    Clicker Fusion 2.5 DeveloperAndroid Export ModuleSWF Export Module

    Join Date
    Jun 2007
    Posts
    153
    Mentioned
    0 Post(s)
    Tagged
    0 Thread(s)
    that was it, thanks!
    i figured there was a path somewhere that needed to be tweaked, but could not figure where it was

    specifically it is tools>preferences>general - exporters and in this case the path to the android SDK i installed (though the path to the java JDK is there as well)

    thanks again

  4. #4
    Clicker Fusion 2.5 DeveloperAndroid Export ModuleHTML5 Export ModuleiOS Export ModuleUniversal Windows Platform Export ModuleSWF Export Module
    Fusion 2.5 (Steam)Fusion 2.5 Developer (Steam)Android Export Module (Steam)HTML5 Export Module (Steam)iOS Export Module (Steam)Universal Windows Platform Export Module (Steam)
    DaveC's Avatar
    Join Date
    Jun 2007
    Location
    Perth, Australia
    Posts
    2,111
    Mentioned
    13 Post(s)
    Tagged
    0 Thread(s)
    Glad to help, we Daves have to stick together!

    CT should add a sticky FAQ to each exporter forum to help with common problems like these.. I'm sure it's happened to a bunch of other people too.

  5. #5
    Clicker Fusion 2.5 DeveloperAndroid Export ModuleHTML5 Export Module
    foyzul2002's Avatar
    Join Date
    Nov 2011
    Location
    London, UK
    Posts
    109
    Mentioned
    0 Post(s)
    Tagged
    0 Thread(s)
    Hi guys, I have a similar build problem for Fusion Dev:

    BUILD FAILED
    C:\Program Files (x86)\Android\android-sdk\tools\ant\build.xml:479: Unable to parse the SDK.

    ......................
    I've pointed everything to the correct place and it worked fine when I had Fusion 2.5 standard, but it's only recently started to give this error for the Fusion Dev version.

    Anyone know what this problem means?

  6. #6
    Clickteam Clickteam
    Jeff's Avatar
    Join Date
    Jun 2006
    Location
    Battle Ground Washington
    Posts
    11,820
    Mentioned
    7 Post(s)
    Tagged
    2 Thread(s)
    Hey Foyzul2002 -- I have never heard of that error before.

    I think this one you might have to dig around in google and see whats going on.

    I found one entry here --
    https://groups.google.com/forum/#!to...rs/NRyG2nqEsFI

  7. #7
    Clicker Fusion 2.5 DeveloperAndroid Export ModuleHTML5 Export ModuleiOS Export ModuleSWF Export Module
    Fusion 2.5 (Steam)Fusion 2.5 Developer (Steam)Android Export Module (Steam)HTML5 Export Module (Steam)iOS Export Module (Steam)
    Sparckman's Avatar
    Join Date
    Feb 2011
    Location
    Planet of the Kangaroos
    Posts
    1,423
    Mentioned
    4 Post(s)
    Tagged
    0 Thread(s)
    1) C:\Program Files (x86)\Android\android-sdk\tools\ant\build.xml

    Take your android SDK out of program files / put it on my documents or somewhere
    where you have more permissions.

    2) You need to update tools



    This is the path I'm using for mine
    C:\Users\Halo\SDK\adt-bundle-windows-x86_64-20131030\adt-bundle-windows-x86_64-20131030

  8. #8
    Clicker Fusion 2.5 DeveloperAndroid Export ModuleHTML5 Export Module
    foyzul2002's Avatar
    Join Date
    Nov 2011
    Location
    London, UK
    Posts
    109
    Mentioned
    0 Post(s)
    Tagged
    0 Thread(s)
    @Jeff @sparckman Thanks guys, yes it is the Android SDK, a few things need to be updated or installed. The extensions mentioned by sparckman are correct. Thanks guys, I thought it was a fusion Dev specific thing because standard fusion build did not give me any errors.

  9. #9
    Clickteam Clickteam
    Fernando's Avatar
    Join Date
    Dec 2006
    Posts
    5,898
    Mentioned
    116 Post(s)
    Tagged
    2 Thread(s)
    you need to have : platform-tools and at least ONE build-tools use the last most of the time.
    Regards,


    Fernando Vivolo

    ... new things are coming ...

  10. #10
    Clicker Fusion 2.5 DeveloperAndroid Export Module

    Join Date
    Aug 2015
    Posts
    11
    Mentioned
    0 Post(s)
    Tagged
    0 Thread(s)
    Buildfile: C:\Users\Joey\AppData\Local\Temp\And1BDD.tmp\build .xml

    -set-mode-check:

    -set-debug-files:

    -check-env:
    [checkenv] Android SDK Tools Revision 24.3.4
    [checkenv] Installed at C:\androidsdk

    -setup:
    [echo] Project Name: RuntimeAndroid
    [gettype] Project Type: Application

    -set-debug-mode:

    -debug-obfuscation-check:

    -pre-build:

    -build-setup:
    [getbuildtools] Using latest Build Tools: 23.0.0
    [echo] Resolving Build Target for RuntimeAndroid...
    [gettarget] Project Target: Android 4.3.1
    [gettarget] API level: 18
    [echo] ----------
    [echo] Creating output directories if needed...
    [mkdir] Created dir: C:\Users\Joey\AppData\Local\Temp\And1BDD.tmp\bin
    [mkdir] Created dir: C:\Users\Joey\AppData\Local\Temp\And1BDD.tmp\bin\r es
    [mkdir] Created dir: C:\Users\Joey\AppData\Local\Temp\And1BDD.tmp\bin\r sObj
    [mkdir] Created dir: C:\Users\Joey\AppData\Local\Temp\And1BDD.tmp\bin\r sLibs
    [mkdir] Created dir: C:\Users\Joey\AppData\Local\Temp\And1BDD.tmp\gen
    [mkdir] Created dir: C:\Users\Joey\AppData\Local\Temp\And1BDD.tmp\bin\c lasses
    [mkdir] Created dir: C:\Users\Joey\AppData\Local\Temp\And1BDD.tmp\bin\d exedLibs
    [echo] ----------
    [echo] Resolving Dependencies for RuntimeAndroid...
    [dependency] Library dependencies:
    [dependency] No Libraries
    [dependency]
    [dependency] ------------------
    [echo] ----------
    [echo] Building Libraries with 'debug'...
    [subant] No sub-builds to iterate on

    -code-gen:
    [mergemanifest] Merging AndroidManifest files into one.
    [mergemanifest] Manifest merger disabled. Using project manifest only.
    [echo] Handling aidl files...
    [aidl] No AIDL files to compile.
    [echo] ----------
    [echo] Handling RenderScript files...
    [echo] ----------
    [echo] Handling Resources...
    [aapt] Generating resource IDs...
    [echo] ----------
    [echo] Handling BuildConfig class...
    [buildconfig] Generating BuildConfig class.

    -pre-compile:

    -compile:
    [javac] Compiling 450 source files to C:\Users\Joey\AppData\Local\Temp\And1BDD.tmp\bin\c lasses
    [javac] warning: [options] source value 1.5 is obsolete and will be removed in a future release
    [javac] warning: [options] target value 1.5 is obsolete and will be removed in a future release
    [javac] warning: [options] To suppress warnings about obsolete options, use -Xlint:-options.
    [javac] C:\Users\Joey\AppData\Local\Temp\And1BDD.tmp\src\M ovements\CRunMvtbox2d8directions.java:29: error: cannot find symbol
    [javac] import Extensions.CRunBox2DBase;
    [javac] ^
    [javac] symbol: class CRunBox2DBase
    [javac] location: package Extensions
    [javac] C:\Users\Joey\AppData\Local\Temp\And1BDD.tmp\src\M ovements\CRunMvtbox2d8directions.java:50: error: cannot find symbol
    [javac] public CRunBox2DBase m_base;
    [javac] ^
    [javac] symbol: class CRunBox2DBase
    [javac] location: class CRunMvtbox2d8directions
    [javac] C:\Users\Joey\AppData\Local\Temp\And1BDD.tmp\src\M ovements\CRunMvtbox2d8directions.java:89: error: cannot find symbol
    [javac] private CRunBox2DBase GetBase()
    [javac] ^
    [javac] symbol: class CRunBox2DBase
    [javac] location: class CRunMvtbox2d8directions
    [javac] C:\Users\Joey\AppData\Local\Temp\And1BDD.tmp\src\M ovements\CRunMvtbox2d8directions.java:101: error: cannot find symbol
    [javac] CRunBox2DBase pBase = (CRunBox2DBase)((CExtension)pObject).ext;
    [javac] ^
    [javac] symbol: class CRunBox2DBase
    [javac] location: class CRunMvtbox2d8directions
    [javac] C:\Users\Joey\AppData\Local\Temp\And1BDD.tmp\src\M ovements\CRunMvtbox2d8directions.java:101: error: cannot find symbol
    [javac] CRunBox2DBase pBase = (CRunBox2DBase)((CExtension)pObject).ext;
    [javac] ^
    [javac] symbol: class CRunBox2DBase
    [javac] location: class CRunMvtbox2d8directions
    [javac] C:\Users\Joey\AppData\Local\Temp\And1BDD.tmp\src\M ovements\CRunMvtbox2d8directions.java:154: error: cannot find symbol
    [javac] this.m_jointName = file.readString(CRunBox2DBase.MAX_JOINTNAME);
    [javac] ^
    [javac] symbol: variable CRunBox2DBase
    [javac] location: class CRunMvtbox2d8directions
    [javac] C:\Users\Joey\AppData\Local\Temp\And1BDD.tmp\src\M ovements\CRunMvtbox2d8directions.java:155: error: cannot find symbol
    [javac] this.m_jointObject = file.readString(CRunBox2DBase.MAX_JOINTOBJECT);
    [javac] ^
    [javac] symbol: variable CRunBox2DBase
    [javac] location: class CRunMvtbox2d8directions
    [javac] C:\Users\Joey\AppData\Local\Temp\And1BDD.tmp\src\M ovements\CRunMvtbox2d8directions.java:180: error: cannot find symbol
    [javac] CRunBox2DBase pBase=this.GetBase();
    [javac] ^
    [javac] symbol: class CRunBox2DBase
    [javac] location: class CRunMvtbox2d8directions
    [javac] C:\Users\Joey\AppData\Local\Temp\And1BDD.tmp\src\M ovements\CRunMvtbox2d8directions.java:211: error: cannot find symbol
    [javac] this.m_body = this.m_base.rCreateBody(BodyDef.BodyType.DynamicBo dy, this.ho.hoX, this.ho.hoY, this.m_angle, this.m_gravity, this, CRunBox2DBase.CBFLAG_FIXEDROTATION, 0);
    [javac] ^
    [javac] symbol: variable CRunBox2DBase
    [javac] location: class CRunMvtbox2d8directions
    [javac] C:\Users\Joey\AppData\Local\Temp\And1BDD.tmp\src\M ovements\CRunMvtbox2d8directions.java:262: error: cannot find symbol
    [javac] case CRunBox2DBase.JTYPE_REVOLUTE:
    [javac] ^
    [javac] symbol: variable CRunBox2DBase
    [javac] location: class CRunMvtbox2d8directions
    [javac] C:\Users\Joey\AppData\Local\Temp\And1BDD.tmp\src\M ovements\CRunMvtbox2d8directions.java:265: error: cannot find symbol
    [javac] case CRunBox2DBase.JTYPE_DISTANCE:
    [javac] ^
    [javac] symbol: variable CRunBox2DBase
    [javac] location: class CRunMvtbox2d8directions
    [javac] C:\Users\Joey\AppData\Local\Temp\And1BDD.tmp\src\M ovements\CRunMvtbox2d8directions.java:268: error: cannot find symbol
    [javac] case CRunBox2DBase.JTYPE_PRISMATIC:
    [javac] ^
    [javac] symbol: variable CRunBox2DBase
    [javac] location: class CRunMvtbox2d8directions
    [javac] C:\Users\Joey\AppData\Local\Temp\And1BDD.tmp\src\M ovements\CRunMvtbox2d8directions.java:461: error: cannot find symbol
    [javac] this.m_base.rBodySetPosition(this.m_body, x, CRunBox2DBase.POSDEFAULT);
    [javac] ^
    [javac] symbol: variable CRunBox2DBase
    [javac] location: class CRunMvtbox2d8directions
    [javac] C:\Users\Joey\AppData\Local\Temp\And1BDD.tmp\src\M ovements\CRunMvtbox2d8directions.java:471: error: cannot find symbol
    [javac] this.m_base.rBodySetPosition(this.m_body, CRunBox2DBase.POSDEFAULT, y);
    [javac] ^
    [javac] symbol: variable CRunBox2DBase
    [javac] location: class CRunMvtbox2d8directions
    [javac] C:\Users\Joey\AppData\Local\Temp\And1BDD.tmp\src\M ovements\CRunMvtbox2d8directions.java:486: error: cannot find symbol
    [javac] float speedf = speed / 100.0f * CRunBox2DBase.SETVELOCITY_MULT;
    [javac] ^
    [javac] symbol: variable CRunBox2DBase
    [javac] location: class CRunMvtbox2d8directions
    [javac] C:\Users\Joey\AppData\Local\Temp\And1BDD.tmp\src\M ovements\CRunMvtbox2d8directions.java:583: error: cannot find symbol
    [javac] force=(float)this.getParam1()/100.0f*CRunBox2DBase.APPLYIMPULSE_MULT;
    [javac] ^
    [javac] symbol: variable CRunBox2DBase
    [javac] location: class CRunMvtbox2d8directions
    [javac] C:\Users\Joey\AppData\Local\Temp\And1BDD.tmp\src\M ovements\CRunMvtbox2d8directions.java:588: error: cannot find symbol
    [javac] force=(float)this.getParam1()/100.0f*CRunBox2DBase.APPLYFORCE_MULT;
    [javac] ^
    [javac] symbol: variable CRunBox2DBase
    [javac] location: class CRunMvtbox2d8directions
    [javac] C:\Users\Joey\AppData\Local\Temp\And1BDD.tmp\src\M ovements\CRunMvtbox2d8directions.java:593: error: cannot find symbol
    [javac] force=(float)this.getParam1()/100.0f*CRunBox2DBase.SETVELOCITY_MULT * SPEEDRATE;
    [javac] ^
    [javac] symbol: variable CRunBox2DBase
    [javac] location: class CRunMvtbox2d8directions
    [javac] C:\Users\Joey\AppData\Local\Temp\And1BDD.tmp\src\M ovements\CRunMvtbox2d8directions.java:608: error: cannot find symbol
    [javac] double velocity = Math.sqrt(v.x * v.x + v.y * v.y)*100.0/(CRunBox2DBase.SETVELOCITY_MULT * SPEEDRATE);
    [javac] ^
    [javac] symbol: variable CRunBox2DBase
    [javac] location: class CRunMvtbox2d8directions
    [javac] C:\Users\Joey\AppData\Local\Temp\And1BDD.tmp\src\R untime\MMFRuntime.java:1645: warning: non-varargs call of varargs method with inexact argument type for last parameter;
    [javac] Method m = c.getDeclaredMethod("disconnect", null);
    [javac] ^
    [javac] cast to Class<?> for a varargs call
    [javac] cast to Class<?>[] for a non-varargs call and to suppress this warning
    [javac] C:\Users\Joey\AppData\Local\Temp\And1BDD.tmp\src\R untime\MMFRuntime.java:1646: warning: non-varargs call of varargs method with inexact argument type for last parameter;
    [javac] Object o = m.invoke(null, null);
    [javac] ^
    [javac] cast to Object for a varargs call
    [javac] cast to Object[] for a non-varargs call and to suppress this warning
    [javac] C:\Users\Joey\AppData\Local\Temp\And1BDD.tmp\src\R untime\MMFRuntime.java:1660: warning: non-varargs call of varargs method with inexact argument type for last parameter;
    [javac] Method m = c.getDeclaredMethod("connect", null);
    [javac] ^
    [javac] cast to Class<?> for a varargs call
    [javac] cast to Class<?>[] for a non-varargs call and to suppress this warning
    [javac] C:\Users\Joey\AppData\Local\Temp\And1BDD.tmp\src\R untime\MMFRuntime.java:1661: warning: non-varargs call of varargs method with inexact argument type for last parameter;
    [javac] Object o = m.invoke(null, null);
    [javac] ^
    [javac] cast to Object for a varargs call
    [javac] cast to Object[] for a non-varargs call and to suppress this warning
    [javac] C:\Users\Joey\AppData\Local\Temp\And1BDD.tmp\src\R untime\MMFRuntime.java:1675: warning: non-varargs call of varargs method with inexact argument type for last parameter;
    [javac] Method m = c.getDeclaredMethod("isConnected", null);
    [javac] ^
    [javac] cast to Class<?> for a varargs call
    [javac] cast to Class<?>[] for a non-varargs call and to suppress this warning
    [javac] C:\Users\Joey\AppData\Local\Temp\And1BDD.tmp\src\R untime\MMFRuntime.java:1676: warning: non-varargs call of varargs method with inexact argument type for last parameter;
    [javac] Object o = m.invoke(null, null);
    [javac] ^
    [javac] cast to Object for a varargs call
    [javac] cast to Object[] for a non-varargs call and to suppress this warning
    [javac] Note: Some input files use or override a deprecated API.
    [javac] Note: Recompile with -Xlint:deprecation for details.
    [javac] Note: Some input files use unchecked or unsafe operations.
    [javac] Note: Recompile with -Xlint:unchecked for details.
    [javac] 19 errors
    [javac] 9 warnings

    I tried so many tutorials and instructions and downloads and nothing works. PLEASE HELP. NO MATTER WHAT I DO I CAN'T BUILD FOR ANDROID I KEEP GETTING THIS...



    BUILD FAILED
    C:\androidsdk\tools\ant\build.xml:716: The following error occurred while executing this line:
    C:\androidsdk\tools\ant\build.xml:730: Compile failed; see the compiler error output for details.

    Total time: 4 seconds

Page 1 of 6 1 2 3 ... LastLast

Similar Threads

  1. Android Build Error
    By dsilvers in forum Android Export Module Version 2.0
    Replies: 21
    Last Post: 28th February 2014, 12:22 AM
  2. Problem with Android Exporter, Java JDK ...
    By thomasfrenberg in forum Android Export Module 2.5
    Replies: 11
    Last Post: 8th February 2014, 04:27 PM
  3. Error installing Android Exporter with purchased 2.5
    By RhysD in forum Android Export Module Version 2.0
    Replies: 10
    Last Post: 13th December 2013, 04:44 PM
  4. Android Build Error
    By dsilvers in forum Multimedia Fusion 2 - Technical Support
    Replies: 0
    Last Post: 2nd April 2013, 01:51 AM
  5. Trying Android again... getting error 83 on build
    By Tuna in forum Android Export Module Version 2.0
    Replies: 2
    Last Post: 20th January 2013, 04:33 PM

Posting Permissions

  • You may not post new threads
  • You may not post replies
  • You may not post attachments
  • You may not edit your posts
  •